{"text_format":"1","workbook":"xlsx","n_sheets":14,"sheets":["Instructions","Edits","Fixes","Entry","Specs","Database","Jobsheet1","Jobsheet3","Jobsheet5","O&M","TAMU","EX_Soil_Test","break","A&M"],"not_rendered":{"charts":0,"images":0,"macros":1,"external_links":1,"defined_names":44,"comments":0,"pivot_tables":0},"unopened":[],"bounds":{"document_bytes":16777216,"sheet_cells":100000,"rows_first":2000,"rows_last":500,"rows_between":2000,"halvings":0,"cell_chars":16384,"cell_head_chars":4096},"cells_cut":0,"cells_raw":0,"read":"whole","date_system":"1900"}

{"sheet":"Instructions","index":0,"n_rows":61,"n_cols":6,"rows_kept":61,"cut":false,"hidden":false,"merged":[[52,1,52,6],[57,1,57,6],[59,1,59,6],[60,1,60,6],[53,1,53,6],[54,1,54,6],[56,1,56,6],[55,1,55,6],[58,1,58,6],[16,1,16,6],[15,1,15,6],[12,1,12,6],[23,1,23,6],[22,1,22,6],[19,1,19,6],[1,1,1,6],[2,1,2,6],[3,1,3,6],[10,1,10,6],[4,1,4,6],[5,1,5,6],[6,1,6,6],[7,1,7,6],[8,1,8,6],[9,1,9,6],[50,1,50,6],[43,1,43,6],[48,1,48,6],[49,1,49,6],[47,1,47,6],[45,1,45,6],[46,1,46,6],[44,1,44,6],[24,1,24,6],[17,1,17,6],[18,1,18,6],[31,1,31,3],[25,1,25,6],[27,1,27,2],[28,1,28,3],[29,1,29,3],[33,1,33,3],[42,1,42,6],[41,1,41,6],[38,1,38,3],[37,1,37,3],[34,1,34,3],[35,1,35,3],[36,1,36,3],[11,1,11,6],[13,1,13,6],[14,1,14,6],[51,1,51,6],[20,1,20,6],[21,1,21,6],[39,1,39,3],[40,1,40,6],[30,1,30,3],[32,1,32,3]]}
[]
[null,"INSTRUCTIONS VERSION 5"]
[]
[null,"These instructions are intended to provide guidance to users of this spreadsheet.  USE THIS SPREADSHEET ONLY FOR INORGANIC NUTRIENT PLANS!"]
[null,"This version includes several improvements to the previous version.  There are five primary changes plus numerous small fixes.  The primary changes are: "]
[null,"1.  Adds the Topdressing amount that A&M requires as part of Grass Establishment."]
[null,"2.  Fixes the cross reference error relative to the Purpose identified on the Entry Sheet and the printouts."]
[null,"3.  Cleans up the formulas on the bottom of the Entry Sheet."]
[null,"4.  Provides a way to view the Establishment Year only."]
[null,"5.  Provides a way to print the Establishment Year only."]
[null,"Use PgDn, PgUp, Up Arrow, Down Arrow keys on the keyboard or the Vertical Scroll bar to view the full set of instructions."]
[null,"The input sheet consists of several sections : 1) Heading ( Landuser, field number, assisted by, year 1 of plan, and rainfall plus irrigation amount); 2) Purpose ( Optimum yield, quick cover, water quality, soil condition ); 3) Targeted Use (Crop, grass establishment, or grass production); 4) Soil test Analysis Method must be Mehlich III with ICP (Inductively Coupled Plasma) to meet the Standard requirements.  5) The soil test results including at a minimum pH, N, P, and K.  6) Crop or grass species and yield goal (establishment, year 1, year 2, year 3, year 4 and year 5 as appropriate ); 7) Maximum amount recommended in pounds per acre - ( N, P, K, and Lime ); 8) Command buttons for use in clearing data, navagation between worksheet areas, and printing worksheets; 9) Credits ( Allows for entry of nutrient credits from other sources; 10) A specification section is available for each year of the plan to address specfications relative to method, form, timing of application.  "]
[null,"The length of the plan (3 year or 5 years) is determined by the rainfall + irrigation amount.  The standard indicates that when this amount is greater than 25\", then a 3 year plan will be developed and when it is less than 25\", a 5 year plan is to be developed.  The information that you enter will automatically be directed to a 3 year printout or a 5 year printout based on the rainfall amount that you enter."]
[null,"Yellow cells require data for proper operation of the worksheet.  While progressing through data input, the number of yellow cells changes.  However, all yellow cells must be completed except for the Lime cells.  Enter the amount of lime if the soil test indicates that lime is needed.   At least 1 cell in the purpose group must be marked.  More than one may be marked if applicable.  Green cells are for optional use. "]
[null,"HEADING - enter the name of the landuser, field number, name of person providing assistance, the first year of the plan, and the county rainfall average PLUS any irrigation in inches."]
[null,"PURPOSE - Select any or all that apply.  This section indicates the portion of the standard that you are addressing.  Normally, the optimum yield will be marked.  Marks are made by clicking on the box with the X .  If you make a mistake and want to erase the mark, click on the box with the < sign beside of the cell."]
[null,"LANDUSE - Select either crop, grass establishment, or grass production."]
[null,"SOIL TEST METHOD -  Any soil laboratory results will be accepted provided the phosphorus extraction method is acceptable.  The only approved and acceptable phosphorus extraction method in Texas is Mehlich III with ICP (Inductively Coupled Plasma).   "]
[null,"SOIL TEST DATA - Identify the soil test method.  ONLY MEHLICH III with ICP is acceptable according to the Standard.  If you do not know the method, the appropriate lab must be contacted and that information must be obtained.  The program will take you to the proper cell to enter the soil test data in the yellow cells.  Enter the N,P,K, and pH from the soil test results."]
[null,"CROP OR GRASS SPECIES AND YIELD GOAL - This area allows for the user to define the crop or grass species and the producer's yield goal.  Drop down boxes with vertical scroll bars allow for selection from a list.  If an error in selection is made, simply make the proper reselection.  The program will clear the previous selection.  Select the proper crop and yield for each of the required three or five years."]
[null,"If any required data is missing, the crop selection cell will turn red and have the message \"Data Missing\".  Check the Purpose, Landuse, Soil Test Data and Crop section, you have left something out."]
[null,"MAXIMUM AMOUNT RECOMMENDED IN LBS / AC - The N, P, and K are computed based on soil test results and on crop or grass species and yield goal.  The cell for Lime - Ton(s) allows for input of a lime application recommendation.  It will turn yellow indicating that an entry may  be needed if the pH is below 6.0.  When there is a lime recommendation, enter that amount in the appropriate cell."]
[null,"The column labeled as TOPDRESS N FOR ESTABLISHMENT is new to this version.  Whenever grass establishment has been checked and identified as the Land Use, an amount will automatically be entered based on the soil test data.  This amount is required as the topdressing portion of the grass establishment before the establishment is complete.  This amount is in addition to that amount shown in the column labeled \"N\".  This amount also shows up in RED on the SPECS sheet in Year 1 immediately under the row labeled \"RECOMMENDED NUTRIENT APPPLICATION TO MEET YIELD GOAL:\".  This calls your attention to the fact that this amount needs to be discussed in your discussion in the SPECIFICATION sectiion labeled \"METHOD, FORM, AND TIMING\"."]
[null,"CREDITS - Allows for entry of nutrient credits from other sources.  There is a credit section available for each year."]
[null,"SPECS - These are the specification sections, one for each year.  Use this section to describe how fertilizer will be applied, timing of application, split applications, lime application, etc.  "]
[null,"NITROGEN TIMING - When the production target is higher than the minimum amount, the total amount of nitrogen has already been adjusted on the following crops to reflect the higher production.  The following is the normal A&M recommendation for split-application of the nitrogen.  There is a drop-down menu at the top of each specification screen (Split Application Suggestions).  Click on the down arrow button to the right and you can quickly refer to this information."]
[]
[null,"Species",null,null,null,"Apply units of N"]
[null,{"$f":"Database!B702","v":0},null,null,null,{"$f":"Database!F702","v":0}]
[null,{"$f":"Database!B703","v":0},null,null,null,{"$f":"Database!F703","v":0}]
[null,{"$f":"Database!B704","v":0},null,null,null,{"$f":"Database!F704","v":0}]
[null,{"$f":"Database!B705","v":0},null,null,null,{"$f":"Database!F705","v":0}]
[null,{"$f":"Database!B706","v":0},null,null,null,{"$f":"Database!F706","v":0}]
[null,{"$f":"Database!B707","v":0},null,null,null,{"$f":"Database!F707","v":0}]
[null,{"$f":"Database!B708","v":0},null,null,null,{"$f":"Database!F708","v":0}]
[null,{"$f":"Database!B709","v":0},null,null,null,{"$f":"Database!F709","v":0}]
[null,{"$f":"Database!B710","v":0},null,null,null,{"$f":"Database!F710","v":0}]
[null,{"$f":"Database!B711","v":0},null,null,null,{"$f":"Database!F711","v":0}]
[null,{"$f":"Database!B712","v":0},null,null,null,{"$f":"Database!F712","v":0}]
[null,{"$f":"Database!B713","v":0},null,null,null,{"$f":"Database!F713","v":0}]
[null,"POTASSIUM TIMING - Any time more than 150 # of K20 is to be applied, it should be split-applied."]
[null,"COMMAND BUTTONS - The command buttons allow a mouse click to perform complicated tasks.  The buttons and their actions are described below."]
[null,"CLEAR ALL - Clicking this button clears ALL data.  Use it to clear a previous job during the same session and prior to exiting.  By doing this, you will have a clean sheet to start with for the next plan.  This button has a safety feature.  When you click this button, it gives you a chance to cancel, in case you clicked the button by accident.  If you answer the question with a YES, then it will continue to clear the sheet.  If you answer NO, then it will not clear the sheet and will take you back to where you were.  Hopefully, this will help people to avoid erasing data accidently and having to re-enter it."]
[null,"ENTER CREDITS - Navigates to the credits section of the worksheet for the appropriate year."]
[null,"EDIT SPECS YEAR  1 - Navigates to the specifications section of the worksheet that is specific to year 1."]
[null,"EDIT SPECS YEAR  2 - Navigates to the specifications section of the worksheet that is specific to year 2."]
[null,"EDIT SPECS YEAR  3 - Navigates to the specifications section of the worksheet that is specific to year 3."]
[null,"EDIT SPECS YEAR  4 - Navigates to the specifications section of the worksheet that is specific to year 4."]
[null,"EDIT SPECS YEAR  5 - Navigates to the specifications section of the worksheet that is specific to year 5."]
[null,"PRINT - When you press the print button, you will be asked if you want to print the Establishment Year, if this is a Nutrient Management Plan for Establishment only, then you would click the YES button and it will proceed by asking if you want to print the O&M sheet.  If you click NO, you are indicating that this nutrient management plan is for 3 or 5 years based on where you are located and it will then ask the question relative to the O&M sheet.  If you indicate YES and have not checked ESTABLISHMENT for the Land Use, you will get an error message and it will abort.  You will simply need to go back and correct the Land Use box and try again.  You will only need to print the O&M sheet one time for each plan.  So if you have 5 fields, you will print 1 O&M sheet plus 1 sheet for each individual soil test (field) that you have.  In this case, you will end up with 6 sheets.  Do not try to print using the File, Print Menus.  If you do, your printed copy will not be formated correctly and will not fit on a page properly.  This macro sets the print options correctly."]
[null,"VIEW JOBSHEET - Navigates to the proper jobsheet (Establishment Year, 3 year or 5 year) for a preview by the user if needed.  A button is provided to navigate back to the Entry Sheet.  No entry is allowed on the jobsheet itself.  All entries are done on the Entry Sheet."]
[null,"EXIT - Use this button to exit the program.  It puts all standard bars, such as headers, status, etc. back on the standard EXCEL spreadsheet.  It also saves the worksheet in its current condition."]
[null,"Draw the sketch of the field(s) involved and show any and all sensitive areas.  Show drainage ditches, roads, houses, and other features that may be important to locating the site and/or other considerations that may be applicable to the plan including sensitive features.."]
[null,"The generic plan narrative in the conservation plan, the first two pages of the Nutrient Management Jobsheet giving the generic information and this printout along with a copy of the soil test results should be sufficient for the nutrient management component of the conservation plan."]
[null,"This spreadsheet and jobsheet is to be used as INTERIM guidance until a better method has been developed.  This spreadsheet utilizes the Texas NRCS June 2000 Nutrient Management Standard as the basis.  This jobsheet utilizes the soil test conversion methods specified in Appendix 3 of the Standard and this spreadsheet also utilizes the A&M crop recommendations found at the Texas A&M website as defined in the Standard.  The information found on the website has been converted into a database for lookup tables in this spreadsheet.  The basic database in this spreadsheet MUST BE KEPT CURRENT by monitoring the A&M website.  There should not be more than a 5 pound difference of any nutrient recommendation between this jobsheet and the TAMU recommendation for the same species and yield goal.  This 5 pound difference will generally be due to the \"rounding\" of numbers.  This program rounds to the nearest 5 pounds using standard rounding protocols."]
[null,"If anyone finds that the crop recommendations at the Texas A&M website differs more than 5 pounds from what is in this spreadsheet, PLEASE let me know as soon as possible.  For additional information, feel free to contact me, Jim Childers, office- 361-241-0609, FAX- 361-241-0609, mobile - 361-813-4911 or email jim.childers@tx.usda.gov"]
[]
[null,"Jim Childers"]
[null,"USDA-NRCS"]
[null,"Zone Conservation Agronomist"]
[null,"Corpus Christi"]

{"sheet":"Edits","index":1,"n_rows":19,"n_cols":3,"rows_kept":19,"cut":false,"hidden":true,"merged":[]}
["Date","Initials","Summary of Changes"]
["2004-08-20","JRC","Received the new Mehlich III \"P\" formulas from Sam Feagley. "]
["2004-09-09","JRC","Finally figured out the new \"P\" formulas.  Began entering the \"P\" rates and the \"P\" factors into the database sheet.  Updated the soil test conversion formulas on the various sheets to match the Soil Test Conversion \"stand alone\" spreadsheet.  This included changing the TAMU P recommendation breakpoints to the new Mehlich III P breakpoints.  Cleaned up the A&M sheet to only reflect the \"P\" lookup information."]
["2004-09-11","JRC","Finalized the \"P\" formulas in the database to reflect the Mehlich III \"P\" rates, \"P\" factors and the P2O5 calculations.  This included updating and modifying the Entry sheet references for the P2O5 recommendations."]
["2004-09-13","JRC","Sent Tony Provin and Sam Feagley an email relative to the concerns for the cotton nitrogen recommendation which appears to have been changed from 50-75-100 # N to 40-60-80 # N for 1 bale, 1.5 bale and 2 bale cotton respectively and the potassium recommendation for improved bermudagrass establishment."]
["2004-09-23","JRC","Received email from Tony Provin that the cotton should be 50-75-100 # N and that their program was wrong.  Also, the K recommendation that I have is correct."]
["2004-10-21","JRC","Corrected error on Entry Page in recommendation amounts."]
["2005-01-13","JRC","Changed the breakpoints for TAMU P recommendations based on the new lab numbers."]
["2004-01-19","JRC","On Jobsheet 1, 3 and 5, edited the formulas in the current soil test level blocks to correct error on Bray II results."]
["2005-01-31","JRC","Corrected bermudagrass \"K\" factors in the Database according to current TAMU formulas.  Corrected a few \"N\" factors to match current TAMU formulas.  Left the budgeting process to zero out P and K in the second, third, fourth, and fifth years to the breakpoint between High/Very High.  This is the same philsophy that was used previously.  TAMU has different numbers on their Lab Report for Critical Level.  Have not been able to get those exact numbers yet."]
["2005-02-24","JRC","Corrected P error for 2-5 years to breakpoint 49/50"]
["2005-02-26","JRC","Added A&M rating on TAMU and Mehlich III sheets.  Change breakpoint references for Nutrient budgets of P and K to actual cells rather than hard numbers to simplify future edits of breakpoint changes.  Edited Database to match TAMU Lab formulas.  Edited formulas on Entry sheet for 2-5 years for K."]
["2005-02-27","JRC","Corrected P formulas for Rice, Alfalfa, Blueberries and Ryegrass due to change from Texas Juice to Mehlich III with ICP."]
["2005-04-06","JRC","Corrected all N, P, and K formulas to match the Soil Lab formulas.  The charts on the Web site are not accurate for K for bermudagrass."]
["2005-05-04","JRC","Corrected N formulas for budgeting for second - fifth years."]
["2005-06-21","JRC","Corrected Olsen's conversion Very High Phosphorus lookup column."]
["2005-06-21","JRC","Updated N recommendations to match the CNMP worksheet."]
["2005-06-21","JRC","Deleted Soil Test Conversions entry options and other information as well as macros for those conversions.  Sheet now only accepts Mehlich III.  Edited Clear All macro to take out cell and macro references to other types of Soil Analyses. "]
["2005-07-16","jrc","edited the database column A.  Numbers were out of order."]

{"sheet":"Fixes","index":2,"n_rows":9,"n_cols":2,"rows_kept":9,"cut":false,"hidden":false,"merged":[[2,1,2,8],[3,1,3,8],[4,1,4,8],[5,1,5,8],[6,1,6,8],[7,1,7,8],[8,1,8,8],[9,1,9,8],[10,1,10,8],[11,1,11,8],[12,1,12,8],[13,1,13,8],[14,1,14,8],[15,1,15,8],[16,1,16,8],[17,1,17,8],[18,1,18,8],[19,1,19,8],[20,1,20,8],[21,1,21,8],[26,1,26,8],[27,1,27,8],[22,1,22,8],[23,1,23,8],[24,1,24,8],[25,1,25,8]]}
["Most current fixes:"]
[]
["2006-04-10","fixed the \"Bermudagrass, Common, Hay  (1 cutting + grazing)\" Max N rate. Changed from 11 to 70."]
["2006-05-08","fixed soybeans"]
["2007-03-01","Forage numbers revised based on TAMU, Forage N recs. posted 12/11/06, Forage P recs. posted 11/29/06, and Forage K recs. posted 12/11/06"]
["2007-03-19","Unhid jobsheet sheets. Print macro does not work right with them hidden."]
["2007-03-20","Fixed wheat grain only crops so they work properly."]
["2007-04-17","Added updated P numbers for corn, cotton, and grain sorghum"]
["2011-02-23","Fixed Corn K numbers."]

{"sheet":"Entry","index":3,"n_rows":151,"n_cols":21,"rows_kept":151,"cut":false,"hidden":false,"merged":[[0,2,0,3],[115,0,115,3],[20,18,21,18],[8,3,10,6],[25,1,25,3],[111,0,111,3],[112,0,112,3],[113,0,113,3],[114,0,114,3],[107,0,107,3],[140,5,140,6],[142,5,142,6],[0,6,0,7],[11,0,11,1],[22,1,22,3],[0,0,0,1],[1,0,1,1],[2,0,2,1],[3,0,3,1],[0,4,0,5],[90,0,90,3],[133,2,133,3],[138,5,138,6],[137,2,137,3],[138,2,138,3],[134,5,134,6],[134,2,134,3],[136,5,136,6],[135,2,135,3],[136,2,136,3],[108,0,108,3],[109,0,109,3],[110,0,110,3],[25,13,25,15],[26,13,26,15],[28,13,28,15],[29,13,29,15],[30,13,30,15],[27,13,27,15],[89,0,89,3],[10,0,10,1],[130,0,132,1],[134,0,136,1],[128,2,129,3],[92,0,92,3],[93,0,93,3],[94,0,94,3],[95,0,95,3],[96,0,96,3],[97,0,97,3],[5,4,7,6],[2,2,2,3],[23,13,23,15],[5,0,5,2],[6,0,6,1],[7,0,7,1],[8,0,8,1],[4,0,4,1],[9,0,9,1],[22,13,22,15],[24,13,24,15],[23,1,23,3],[24,1,24,3],[19,4,19,7],[19,8,20,8],[20,0,20,3],[91,0,91,3],[31,13,31,15],[70,0,70,8],[34,0,34,8],[71,0,71,3],[78,0,78,3],[79,0,79,3],[77,0,77,3],[52,0,52,8],[60,0,60,3],[56,0,56,3],[57,0,57,3],[58,0,58,3],[59,0,59,3],[106,0,106,8],[12,0,12,2],[21,1,21,3],[72,0,72,3],[73,0,73,3],[74,0,74,3],[75,0,75,3],[76,0,76,3],[88,0,88,8],[61,0,61,3],[128,4,129,6],[132,5,132,6],[131,2,131,3],[132,2,132,3],[130,2,130,3],[130,5,130,6],[139,2,139,3],[140,2,140,3],[142,0,144,1],[142,2,142,3],[143,2,143,3],[144,2,144,3],[138,0,140,1],[144,5,144,6],[145,2,145,3],[146,0,148,1],[146,2,146,3],[146,5,146,6],[147,2,147,3],[148,2,148,3],[148,5,148,6],[35,0,35,3],[36,0,36,3],[37,0,37,3],[38,0,38,3],[39,0,39,3],[40,0,40,3],[41,0,41,3],[42,0,42,3],[43,0,43,3],[53,0,53,3],[54,0,54,3],[55,0,55,3]]}
["Landuser",null,"example",null,"Purpose",null,"Landuse",null,null,null,null,null,null,null,null,null,null,null,{"$f":"IF(OR($R$27=Database!$B$218,$R$27=Database!$B$219,$R$27=Database!$B$220,$R$27=Database!$B$221,$R$27=Database!$B$222,$R$27=Database!$B$223,$R$27=Database!$B$224,$R$27=Database!$B$225),1,0)","v":0},{"$f":"IF(OR($R$31=Database!$B$218,$R$31=Database!$B$219,$R$31=Database!$B$220,$R$31=Database!$B$221,$R$31=Database!$B$222,$R$31=Database!$B$223,$R$31=Database!$B$224,$R$31=Database!$B$225),1,0)","v":0}]
["Field Number",null,"1",null,"Optimum Yield ..",{"$f":"IF(P2=\"\",\"\",P2)","v":"x"},"               Crops",{"$f":"IF(O2=\"\",\"\",O2)","v":"x"},null,null,null,null,null,null,"x","x",null,null,{"$f":"IF(OR($R$27=Database!$B$5,$R$27=Database!#REF!,$R$27=Database!$B$6,$R$27=Database!$B$7),1,0)","v":{"$error":"#REF!"}},{"$f":"IF(OR($R$31=Database!$B$5,$R$31=Database!#REF!,$R$31=Database!$B$6,$R$31=Database!$B$7),1,0)","v":{"$error":"#REF!"}}]
["Assisted By",null,null,null,"Quick Cover …..",{"$f":"IF(P3=\"\",\"\",P3)","v":""},"Grass Est.",{"$f":"IF(O3=\"\",\"\",O3)","v":""},null,null,null,null,null,null,null,null,null,null,{"$f":"IF(OR($R$27=Database!$B$230,$R$27=Database!$B$231),1,0)","v":0},{"$f":"IF(OR($R$31=Database!$B$230,$R$31=Database!$B$231),1,0)","v":0}]
["Year 1 of plan",null,2007,null,"Water Quality….",{"$f":"IF(P4=\"\",\"\",P4)","v":""},"Forage",{"$f":"IF(O4=\"\",\"\",O4)","v":""},null,null,null,null,null,null,null,null,null,null,{"$f":"IF($R$27=Database!$B$73,1,0)","v":0},{"$f":"IF($R$31=Database!$B$73,1,0)","v":0}]
["Rainfall Inches",null,45,null,"Soil Condition….",{"$f":"IF(P5=\"\",\"\",P5)","v":""},null,null,null,null,null,null,null,null,{"$f":"COUNTA(O2:O4,P2:P4,P7:P11)","v":3}]
["Soil Test",null,null,null,"Inorganic Fertilizers Only      (Version 6)",null,null,null,null,null,null,null,null,null,{"$f":"COUNT(TAMU!A3:D3)","v":4},null,null,null,{"$f":"SUM(S1:S4)","v":{"$error":"#REF!"}},{"$f":"SUM(T1:T4)","v":{"$error":"#REF!"}},"(These formulas goto S5 and T5 if necessary)"]
["Mehlich III",null,{"$f":"IF(P7=\"\",\"\",P7)","v":"x"},null,null,null,null,null,null,null,null,null,null,null,{"$f":"(TAMU!A3)","v":5.6},"x"]
[null,null,{"$f":"IF(P8=\"\",\"\",P8)","v":""}]
[null,null,{"$f":"IF(P9=\"\",\"\",P9)","v":""},"Select Crop or Grass Species and Yield Goal      (Year 4 and 5 are selected only if rainfall is < 25\")"]
[null,null,{"$f":"IF(P10=\"\",\"\",P10)","v":""},null,null,null,null,null,null,null,null,"L","M","N","O",null,"Q","R","S","T"]
[null,null,{"$f":"IF(P11=\"\",\"\",P11)","v":""}]
[null,null,null,null,null,null,null,null,null,null,null,{"$f":"IF(COUNT($L$14:$L$21)>1,\"error\",COUNT($L$14:$L$21))","v":1},{"$f":"IF(COUNT($M$14:$M$21)>1,\"error\",COUNT($M$14:$M$21))","v":1},{"$f":"IF(COUNT($N$14:$N$21)>1,\"error\",COUNT($N$14:$N$21))","v":1},{"$f":"IF(COUNT($O$14:$O$21)>1,\"error\",COUNT($O$14:$O$21))","v":0},{"$f":"IF(COUNT($P$14:$P$21)>1,\"error\",COUNT($P$14:$P$21))","v":0}]
[null,null,null,null,null,null,null,null,null,null,null,{"$f":"COUNT(L14:L17)","v":0},{"$f":"COUNT(M14:M17)","v":0},{"$f":"COUNT(N14:N17)","v":1},{"$f":"COUNT(O14:O17)","v":0},{"$f":"COUNT(P14:P17)","v":0}]
[null,null,null,null,null,null,null,null,null,null,null,null,null,null,null,null,"establish"]
[null,null,null,null,null,null,null,null,null,null,null,null,null,null,null,null,"lawnandgarden"]
[null,null,null,null,null,null,null,null,null,null,null,null,null,53,null,null,"forages"]
[null,null,null,null,null,null,null,null,null,null,null,null,null,null,null,null,"oil"]
[null,null,null,null,null,null,null,null,null,null,null,null,null,null,null,null,"veggies"]
[null,null,null,null,null,null,null,null,null,null,null,13,3,null,null,null,"rowcropsandgrain"]
[null,null,null,null,"                     Max. Amt. Recommended ( # /Ac)",null,null,null,"TopDress N     for           Establishment",null,null,null,null,null,null,null,"turf"]
["Crop / Grass Species Selected:",null,null,null,"N","P","K","LIME(if any)",null,null,null,null,null,null,null,null,"fiber",null,"Crop   Req."]
[{"$f":"$C$4","v":2007},{"$f":"IF(AND(H4=\"\",L16>1),\"Not Grass Production\",IF(AND($H$3=\"\",$L$14>=1),\"Not Establishment\",IF($L$12=\"error\",\"error\",IF(AND($N$23=\"\",$N$24=\"\"),\"No Selection Made\",IF(AND($P$5<>\"\",$P$151<1),\"Enter Crop Residue\",IF(OR($O6<>4,$O$5<3),\"Data Missing\",IF($N$23<>\"\",$N$23,$N$24)))))))","v":"Corn 200 bu"},null,null,{"$f":"IF(Specs!B4<>\"\",Specs!B4,IF(OR($B$22=\"Not Establishment\",$B$22=\"Not Grass Production\",$B$22=\"No Selection Made\",$B$22=\"Data Missing\"),\"\",IF(TAMU!$B$3=\"\",\"\",IF(AND($H$2=\"\",$H$3=\"\",$H$4=\"\"),\"\",IF($L$12=\"error\",\"error\",IF($S$23=\"\",IF(SUM($T$23-$E$44+$Q$131+$Q$133)>=0,FLOOR(($T$23-$E$44+$Q$131+$Q$133),5),0),IF(SUM($S$23-$E$44+$Q$131+$Q$133)>=0,FLOOR(($S$23-$E$44+$Q$131+$Q$133),5),0)))))))","v":245},{"$f":"IF(Specs!C4<>\"\",Specs!C4,IF(OR($B$22=\"Not Establishment\",$B$22=\"Not Grass Production\",$B$22=\"No Selection Made\",$B$22=\"Data Missing\"),\"\",IF(TAMU!$C$3=\"\",\"\",IF(AND($H$2=\"\",$H$3=\"\",$H$4=\"\"),\"\",IF($L$12=\"error\",\"error\",IF($S$24=\"\",IF(SUM($T$24-$G$44)>=0,FLOOR(($T$24-$G$44),5),0),IF(SUM($S$24-$G$44)>=0,FLOOR(($S$24-$G$44),5),0)))))))","v":115},{"$f":"IF(Specs!D4<>\"\",Specs!D4,IF(OR($B$22=\"Not Establishment\",$B$22=\"Not Grass Production\",$B$22=\"No Selection Made\",$B$22=\"Data Missing\"),\"\",IF(TAMU!$D$3=\"\",\"\",IF(AND($H$2=\"\",$H$3=\"\",$H$4=\"\"),\"\",IF($L$12=\"error\",\"error\",IF($S$25=\"\",IF(SUM($T$25-$I$44)>=0,FLOOR(($T$25-$I$44),5),0),IF(SUM($S$25-$I$44)>=0,FLOOR(($S$25-$I$44),5),0)))))))","v":120},1,{"$f":"IF(OR($B$22=\"Not Establishment\",$B$22=\"Data Missing\"),\"\",IF($L$14>0,VLOOKUP($L$14,establish,16),\"\"))","v":""},null,null,{"$f":"COUNT(L18:L21)","v":1},{"$f":"COUNT(M18:M21)","v":1},{"$f":"COUNT(N18:N21)","v":0},{"$f":"COUNT(O18:O21)","v":0},{"$f":"COUNT(P18:P21)","v":0}]
[{"$f":"$C$4+1","v":2008},{"$f":"IF($M$12=\"error\",\"error\",IF(AND($N$25=\"\",$N$26=\"\"),\"No Selection Made\",IF(AND($P$5<>\"\",$P$151<1),\"Enter Crop Residue\",IF(OR($O$6<>4,$O$5<3),\"Data Missing\",IF($N$25<>\"\",$N$25,$N$26)))))","v":"Corn 100 bu"},null,null,{"$f":"IF($B$23=\"No Selection Made\",\"\",IF(TAMU!$B$3=\"\",\"\",IF(AND($H$2=\"\",$H$3=\"\",$H$4=\"\"),\"\",IF($M$12=\"error\",\"error\",IF($S$27=\"\",IF(SUM($T$27-$E$62+$Q$135+$Q$137)>=0,FLOOR(($T$27-$E$62+$Q$135+$Q$137),5),0),IF(SUM($S$27-$E$62+$Q$135+$Q$137)>=0,FLOOR(($S$27-$E$62+$Q$135+$Q$137),5),0))))))","v":120},{"$f":"IF($B$23=\"No Selection Made\",\"\",IF(TAMU!$C$3=\"\",\"\",IF(AND($H$2=\"\",$H$3=\"\",$H$4=\"\"),\"\",IF($M$12=\"error\",\"error\",IF($S$28=\"\",IF(SUM($T$28-$G$62)>=0,FLOOR(($T$28-$G$62),5),0),IF(SUM($S$28-$G$62)>=0,FLOOR(($S$28-$G$62),5),0))))))","v":80},{"$f":"IF($B$23=\"No Selection Made\",\"\",IF(TAMU!$D$3=\"\",\"\",IF(AND($H$2=\"\",$H$3=\"\",$H$4=\"\"),\"\",IF($M$12=\"error\",\"error\",IF($S$29=\"\",IF(SUM($T$29-$I$62)>=0,FLOOR(($T$29-$I$62),5),0),IF(SUM($S$29-$I$62)>=0,FLOOR(($S$29-$I$62),5),0))))))","v":110},null,null,null,null,null,1,{"$f":"IF(OR($L$12=\"error\",$L$12=0,$L$13=0),\"\",IF($L$14>0,VLOOKUP($L$14,establish,2),IF($L$15>0,VLOOKUP($L$15,lawnandgarden,2),IF($L$16>0,VLOOKUP($L$16,forages,2),IF($L$17>0,VLOOKUP($L$17,oil,2))))))","v":""},null,null,{"$f":"IF($L$14>0,1,IF($L$15>0,2,IF($L$16>0,3,IF($L$17>0,4,IF($L$18>0,5,IF($L$19>0,6,IF($L$20>0,7,IF($L$21>0,8,\"\"))))))))","v":6},{"$f":"IF($N$23<>\"\",$N$23,$N$24)","v":"Corn 200 bu"},{"$f":"IF(Specs!B4<>\"\",Specs!B4,IF($Q$23=1,VLOOKUP($L$14,establish,6),IF($Q$23=2,VLOOKUP($L$15,lawnandgarden,6),IF($Q$23=3,VLOOKUP($L$16,forages,6),IF($Q$23=4,VLOOKUP($L$17,oil,6),\"\")))))","v":""},{"$f":"IF($Q$23=5,VLOOKUP($L$18,veggies,6),IF($Q$23=6,VLOOKUP($L$19,rowcropsandgrain,6),IF($Q$23=7,VLOOKUP($L$20,turf,6),IF($Q$23=8,VLOOKUP($L$21,fiber,6),\"\"))))","v":246},"N"]
[{"$f":"$C$4+2","v":2009},{"$f":"IF($N12=\"error\",\"error\",IF(AND($N$27=\"\",$N$28=\"\"),\"No Selection Made\",IF(AND($P$5<>\"\",$P$151<1),\"Enter Crop Residue\",IF(OR($O$6<>4,$O$5<3),\"Data Missing\",IF($N$27<>\"\",$N$27,$N$28)))))","v":"Bermudagrass, Hyb, Hay  12000 lb"},null,null,{"$f":"IF($B$24=\"No Selection Made\",\"\",IF(TAMU!$B$3=\"\",\"\",IF(AND($H$2=\"\",$H$3=\"\",$H$4=\"\"),\"\",IF($N$12=\"error\",\"error\",IF($S$31=\"\",IF(SUM($T$31-$E$80+$Q$139+$Q$141)>=0,FLOOR(($T$31-$E$80+$Q$139+$Q$141),5),0),IF(SUM($S$31-$E$80+$Q$139+$Q$141)>=0,FLOOR(($S$31-$E$80+$Q$139+$Q$141),5),0))))))","v":300},{"$f":"IF($B$24=\"No Selection Made\",\"\",IF(TAMU!$C$3=\"\",\"\",IF(AND($H$2=\"\",$H$3=\"\",$H$4=\"\"),\"\",IF($N$12=\"error\",\"error\",IF($S$32=\"\",IF(SUM($T$32-$G$80)>=0,FLOOR(($T$32-$G$80),5),0),IF(SUM($S$32-$G$80)>=0,FLOOR(($S$32-$G$80),5),0))))))","v":140},{"$f":"IF($B$24=\"No Selection Made\",\"\",IF(TAMU!$D$3=\"\",\"\",IF(AND($H$2=\"\",$H$3=\"\",$H$4=\"\"),\"\",IF($N$12=\"error\",\"error\",IF($S$33=\"\",IF(SUM($T$33-$I$80)>=0,FLOOR(($T$33-$I$80),5),0),IF(SUM($S$33-$I$80)>=0,FLOOR(($S$33-$I$80),5),0))))))","v":250},null,null,null,null,null,1,{"$f":"IF(OR($L$12=\"error\",$L$12=0,$L$22=0),\"\",IF($L$18>0,VLOOKUP($L$18,veggies,2),IF($L$19>0,VLOOKUP($L$19,rowcropsandgrain,2),IF($L$20>0,VLOOKUP($L$20,turf,2),IF($L$21>0,VLOOKUP($L$21,fiber,2))))))","v":"Corn 200 bu"},null,null,null,null,{"$f":"IF(Specs!C4<>\"\",Specs!C4,IF($Q$23=1,VLOOKUP($L$14,establish,9),IF($Q$23=2,VLOOKUP($L$15,lawnandgarden,9),IF($Q$23=3,VLOOKUP($L$16,forages,9),IF($Q$23=4,VLOOKUP($L$17,oil,9),\"\")))))","v":""},{"$f":"IF($Q$23=5,VLOOKUP($L$18,veggies,9),IF($Q$23=6,VLOOKUP($L$19,rowcropsandgrain,9),IF($Q$23=7,VLOOKUP($L$20,turf,9),IF($Q$23=8,VLOOKUP($L$21,fiber,9),\"\"))))","v":117},"P"]
[{"$f":"$C$4+3","v":2010},{"$f":"IF($C$5>=25,\"Do Not Select Crop\",IF($O13=\"error\",\"error\",IF(AND($N$29=\"\",$N$30=\"\"),\"No Selection Made\",IF(AND($P$5<>\"\",$P$151<1),\"Enter Crop Residue\",IF(OR($O$6<>4,$O$5<3),\"Data Missing\",IF($N$29<>\"\",$N$29,$N$30))))))","v":"Do Not Select Crop"},null,null,{"$f":"IF($B$25=\"No Selection Made\",\"\",IF($C$5>=25,\"\",IF(TAMU!$B$3=\"\",\"\",IF(AND($H$2=\"\",$H$3=\"\",$H$4=\"\"),\"\",IF($O$12=\"error\",\"error\",IF($S$35=\"\",IF(SUM($T$35-$E$98+$Q$143+$Q$145)>=2.5,CEILING(($T$35-$E$98+$Q$143+$Q$145)-2.5,5),0),IF(SUM($S$35-$E$98+$Q$143+$Q$145)>=2.5,CEILING(($S$35-$E$98+$Q$143+$Q$145)-2.5,5),0)))))))","v":""},{"$f":"IF($B$25=\"No Selection Made\",\"\",IF($C$5>=25,\"\",IF(TAMU!$C$3=\"\",\"\",IF(AND($H$2=\"\",$H$3=\"\",$H$4=\"\"),\"\",IF($O$12=\"error\",\"error\",IF($S$36=\"\",IF(SUM($T$36-$G$98)>=2.5,CEILING(($T$36-$G$98)-2.5,5),0),IF(SUM($S$36-$G$98)>=2.5,CEILING(($S$36-$G$98)-2.5,5),0)))))))","v":""},{"$f":"IF($B$25=\"No Selection Made\",\"\",IF($C$5>=25,\"\",IF(TAMU!$D$3=\"\",\"\",IF(AND($H$2=\"\",$H$3=\"\",$H$4=\"\"),\"\",IF($O$12=\"error\",\"error\",IF($S$37=\"\",IF(SUM($T$37-$I$98)>=2.5,CEILING(($T$37-$I$98)-2.5,5),0),IF(SUM($S$37-$I$98)>=2.5,CEILING(($S$37-$I$98)-2.5,5),0)))))))","v":""},null,null,null,null,null,2,{"$f":"IF(OR($M$12=\"error\",$M$12=0,$M$13=0),\"\",IF($M$14>0,VLOOKUP($M$14,establish,2),IF($M$15>0,VLOOKUP($M$15,lawnandgarden,2),IF($M$16>0,VLOOKUP($M$16,forages,2),IF($M$17>0,VLOOKUP($M$17,oil,2))))))","v":""},null,null,null,null,{"$f":"IF(Specs!D4<>\"\",Specs!D4,IF($Q$23=1,VLOOKUP($L$14,establish,12),IF($Q$23=2,VLOOKUP($L$15,lawnandgarden,12),IF($Q$23=3,VLOOKUP($L$16,forages,12),IF($Q$23=4,VLOOKUP($L$17,oil,12),\"\")))))","v":""},{"$f":"IF($Q$23=5,VLOOKUP($L$18,veggies,12),IF($Q$23=6,VLOOKUP($L$19,rowcropsandgrain,12),IF($Q$23=7,VLOOKUP($L$20,turf,12),IF($Q$23=8,VLOOKUP($L$21,fiber,12),\"\"))))","v":120.8},"K"]
[{"$f":"$C$4+4","v":2011},{"$f":"IF($C$5>=25,\"Do Not Select Crop\",IF($P14=\"error\",\"error\",IF(AND($N$31=\"\",$N$32=\"\"),\"No Selection Made\",IF(AND($P$5<>\"\",$P$151<1),\"Enter Crop Residue\",IF(OR($O$6<>4,$O$5<3),\"Data Missing\",IF($N$31<>\"\",$N$31,$N$32))))))","v":"Do Not Select Crop"},null,null,{"$f":"IF($B$26=\"No Selection Made\",\"\",IF($C$5>=25,\"\",IF(TAMU!$B$3=\"\",\"\",IF(AND($H$2=\"\",$H$3=\"\",$H$4=\"\"),\"\",IF($P$12=\"error\",\"error\",IF($S$39=\"\",IF(SUM($T$39-$E$116+$Q$147+$Q$149)>=2.5,CEILING(($T$39-$E$116+$Q$147+$Q$149)-2.5,5),0),IF(SUM($S$39-$E$116+$Q$147+$Q$149)>=2.5,CEILING(($S$39-$E$116+$Q$147+$Q$149)-2.5,5),0)))))))","v":""},{"$f":"IF($B$26=\"No Selection Made\",\"\",IF($C$5>=25,\"\",IF(TAMU!$C$3=\"\",\"\",IF(AND($H$2=\"\",$H$3=\"\",$H$4=\"\"),\"\",IF($P$12=\"error\",\"error\",IF($S$40=\"\",IF(SUM($T$40-$G$116+$Q$131+$Q$133)>=2.5,CEILING(($T$40-$G$116+$Q$131+$Q$133)-2.5,5),0),IF(SUM($S$40-$G$116+$Q$131+$Q$133)>=2.5,CEILING(($S$40-$G$116+$Q$131+$Q$133)-2.5,5),0)))))))","v":""},{"$f":"IF($B$26=\"No Selection Made\",\"\",IF($C$5>=25,\"\",IF(TAMU!$D$3=\"\",\"\",IF(AND($H$2=\"\",$H$3=\"\",$H$4=\"\"),\"\",IF($P$12=\"error\",\"error\",IF($S$41=\"\",IF(SUM($T$41-$I$116)>=2.5,CEILING(($T$41-$I$116)-2.5,5),0),IF(SUM($S$41-$I$116)>=2.5,CEILING(($S$41-$I$116)-2.5,5),0)))))))","v":""},null,null,null,null,null,2,{"$f":"IF(OR($M$12=\"error\",$M$12=0,$M$22=0),\"\",IF($M$18>0,VLOOKUP($M$18,veggies,2),IF($M$19>0,VLOOKUP($M$19,rowcropsandgrain,2),IF($M$20>0,VLOOKUP($M$20,turf,2),IF($M$21>0,VLOOKUP($M$21,fiber,2))))))","v":"Corn 100 bu"}]
[null,null,null,null,{"$f":"IF(Specs!B4<>\"\",\"Manual over-ride used for year 1\",\"\")","v":""},null,null,null,null,null,null,null,3,{"$f":"IF(OR($N$12=\"error\",$N$12=0,$N$13=0),\"\",IF($N$14>0,VLOOKUP($N$14,establish,2),IF($N$15>0,VLOOKUP($N$15,lawnandgarden,2),IF($N$16>0,VLOOKUP($N$16,forages,2),IF($N$17>0,VLOOKUP($N$17,oil,2))))))","v":"Bermudagrass, Hyb, Hay  12000 lb"},null,null,{"$f":"IF($M$14>0,1,IF($M$15>0,2,IF($M$16>0,3,IF($M$17>0,4,IF($M$18>0,5,IF($M$19>0,6,IF($M$20>0,7,IF($M$21>0,8,\"\"))))))))","v":6},{"$f":"IF($N$25<>\"\",$N$25,$N$26)","v":"Corn 100 bu"},{"$f":"IF($Q$27=1,VLOOKUP($M$14,establish,5),IF($Q$27=2,VLOOKUP($M$15,lawnandgarden,5),IF($Q$27=3,VLOOKUP($M$16,forages,5),IF($Q$27=4,VLOOKUP($M$17,oil,5),\"\"))))","v":""},{"$f":"IF($Q$27=5,VLOOKUP($M$18,veggies,5),IF($Q$27=6,VLOOKUP($M$19,rowcropsandgrain,5),IF($Q$27=7,VLOOKUP($M$20,turf,5),IF($Q$27=8,VLOOKUP($M$21,fiber,5),\"\"))))","v":120},"N"]
[null,null,null,null,null,null,null,null,null,null,null,null,3,{"$f":"IF(OR($N$12=\"error\",$N$12=0,$N$22=0),\"\",IF($N$18>0,VLOOKUP($N$18,veggies,2),IF($N$19>0,VLOOKUP($N$19,rowcropsandgrain,2),IF($N$20>0,VLOOKUP($N$20,turf,2),IF($N$21>0,VLOOKUP($N$21,fiber,2,0))))))","v":""},null,null,null,null,{"$f":"IF(AND(Entry!$S$5=1,Database!$C$336>='A&M'!L4),0,IF(Database!$C$336>='A&M'!L4,0,IF($Q$27=1,VLOOKUP($M$14,establish,7),IF($Q$27=2,VLOOKUP($M$15,lawnandgarden,7),IF($Q$27=3,VLOOKUP($M$16,forages,7),IF($Q$27=4,VLOOKUP($M$17,oil,7),\"\"))))))","v":""},{"$f":"IF(AND(Entry!$S$5=1,Database!$C$336>='A&M'!L4),0,IF(Database!$C$336>='A&M'!L4,0,IF($Q$27=5,VLOOKUP($M$18,veggies,7),IF($Q$27=6,VLOOKUP($M$19,rowcropsandgrain,7),IF($Q$27=7,VLOOKUP($M$20,turf,7),IF($Q$27=8,VLOOKUP($M$21,fiber,7),\"\"))))))","v":80},"P"]
[null,null,null,null,null,null,null,null,null,null,null,null,4,{"$f":"IF(OR($O$12=\"error\",$O$12=0,$O$13=0),\"\",IF($O$14>0,VLOOKUP($O$14,establish,2),IF($O$15>0,VLOOKUP($O$15,lawnandgarden,2),IF($O$16>0,VLOOKUP($O$16,forages,2),IF($O$17>0,VLOOKUP($O$17,oil,2))))))","v":""},null,null,null,null,{"$f":"IF(Database!$C$337>='A&M'!L5,0,IF($Q$27=1,VLOOKUP($M$14,establish,10),IF($Q$27=2,VLOOKUP($M$15,lawnandgarden,10),IF($Q$27=3,VLOOKUP($M$16,forages,10),IF($Q$27=4,VLOOKUP($M$17,oil,10),\"\")))))","v":""},{"$f":"IF(Database!$C$337>='A&M'!L5,0,IF($Q$27=5,VLOOKUP($M$18,veggies,10),IF($Q$27=6,VLOOKUP($M$19,rowcropsandgrain,10),IF($Q$27=7,VLOOKUP($M$20,turf,10),IF($Q$27=8,VLOOKUP($M$21,fiber,12),\"\")))))","v":110},"K"]
[null,null,null,null,null,null,null,null,null,null,null,null,4,{"$f":"IF(OR($O$12=\"error\",$O$12=0,$O$22=0),\"\",IF($O$18>0,VLOOKUP($O$18,veggies,2),IF($O$19>0,VLOOKUP($O$19,rowcropsandgrain,2),IF($O$20>0,VLOOKUP($O$20,turf,2),IF($O$21>0,VLOOKUP($O$21,fiber,2,0))))))","v":""}]
[null,null,null,null,null,null,null,null,null,null,null,null,5,{"$f":"IF(OR($P$12=\"error\",$P$12=0,$P$13=0),\"\",IF($P$14>0,VLOOKUP($P$14,establish,2),IF($P$15>0,VLOOKUP($P$15,lawnandgarden,2),IF($P$16>0,VLOOKUP($P$16,forages,2),IF($P$17>0,VLOOKUP($P$17,oil,2))))))","v":""},null,null,{"$f":"IF($N$14>0,1,IF($N$15>0,2,IF($N$16>0,3,IF($N$17>0,4,IF($N$18>0,5,IF($N$19>0,6,IF($N$20>0,7,IF($N$21>0,8,\"\"))))))))","v":3},{"$f":"IF($N$27<>\"\",$N$27,$N$28)","v":"Bermudagrass, Hyb, Hay  12000 lb"},{"$f":"IF($Q$31=1,VLOOKUP($N$14,establish,5),IF($Q$31=2,VLOOKUP($N$15,lawnandgarden,5),IF($Q$31=3,VLOOKUP($N$16,forages,5),IF($Q$31=4,VLOOKUP($N$17,oil,5),\"\"))))","v":300},{"$f":"IF($Q$31=5,VLOOKUP($N$18,veggies,5),IF($Q$31=6,VLOOKUP($N$19,rowcropsandgrain,5),IF($Q$31=7,VLOOKUP($N$20,turf,5),IF($Q$31=8,VLOOKUP($N$21,fiber,5),\"\"))))","v":""},"N"]
[null,null,null,null,null,null,null,null,null,null,null,null,5,{"$f":"IF(OR($P$12=\"error\",$P$12=0,$P$22=0),\"\",IF($P$18>0,VLOOKUP($P$18,veggies,2),IF($P$19>0,VLOOKUP($P$19,rowcropsandgrain,2),IF($P$20>0,VLOOKUP($P$20,turf,2),IF($P$21>0,VLOOKUP($P$21,fiber,2,0))))))","v":""},null,null,null,null,{"$f":"IF(AND(Entry!$T$5=1,Database!$C$336>='A&M'!L4),0,IF(Database!$C$336>='A&M'!L4,0,IF($Q$31=1,VLOOKUP($N$14,establish,7),IF($Q$31=2,VLOOKUP($N$15,lawnandgarden,7),IF($Q$31=3,VLOOKUP($N$16,forages,7),IF($Q$31=4,VLOOKUP($N$17,oil,7),\"\"))))))","v":140},{"$f":"IF(AND(Entry!$T$5=1,Database!$C$336>='A&M'!L4),0,IF(Database!$C$336>='A&M'!L4,0,IF($Q$31=5,VLOOKUP($N$18,veggies,7),IF($Q$31=6,VLOOKUP($N$19,rowcropsandgrain,7),IF($Q$31=7,VLOOKUP($N$20,turf,7),IF($Q$31=8,VLOOKUP($N$21,fiber,7),\"\"))))))","v":""},"P"]
[null,null,null,null,null,null,null,null,null,null,null,null,null,null,null,null,null,null,{"$f":"IF(Database!$C$337>='A&M'!L5,0,IF($Q$31=1,VLOOKUP($N$14,establish,10),IF($Q$31=2,VLOOKUP($N$15,lawnandgarden,10),IF($Q$31=3,VLOOKUP($N$16,forages,10),IF($Q$31=4,VLOOKUP($N$17,oil,10),\"\")))))","v":250},{"$f":"IF(Database!$C$337>='A&M'!L5,0,IF($Q$31=5,VLOOKUP($N$18,veggies,10),IF($Q$31=6,VLOOKUP($N$19,rowcropsandgrain,10),IF($Q$31=7,VLOOKUP($N$20,turf,10),IF($Q$31=8,VLOOKUP($N$21,fiber,10),\"\")))))","v":""},"K"]
[]
[{"$f":"\"Year 1  -  ( \"&$C$4&\" )\"","v":"Year 1  -  ( 2007 )"},null,null,null,null,null,null,null,null,null,null,null,null,null,null,null,{"$f":"IF($O$14>0,1,IF($O$15>0,2,IF($O$16>0,3,IF($O$17>0,4,IF($O$18>0,5,IF($O$19>0,6,IF($O$20>0,7,IF($O$21>0,8,\"\"))))))))","v":""},{"$f":"IF($N$29<>\"\",$N$29,$N$30)","v":""},{"$f":"IF($Q$35=1,VLOOKUP($O$14,establish,5),IF($Q$35=2,VLOOKUP($O$15,lawnandgarden,5),IF($Q$35=3,VLOOKUP($O$16,forages,5),IF($Q$35=4,VLOOKUP($O$17,oil,5),\"\"))))","v":""},{"$f":"IF($Q$35=5,VLOOKUP($O$18,veggies,5),IF($Q$35=6,VLOOKUP($O$19,rowcropsandgrain,5),IF($Q$35=7,VLOOKUP($O$20,turf,5),IF($Q$35=8,VLOOKUP($O$21,fiber,5),\"\"))))","v":""},"N"]
["Credits",null,null,null,"N",null,"P2O5",null,"K2O",null,null,null,null,null,null,null,null,null,{"$f":"IF(AND(Entry!$S$5=1,Database!$C$336>='A&M'!L4),0,IF(Database!$C$336>='A&M'!L4,0,IF($Q$35=1,VLOOKUP($O$14,establish,7),IF($Q$35=2,VLOOKUP($O$15,lawnandgarden,7),IF($Q$35=3,VLOOKUP($O$16,forages,7),IF($Q$35=4,VLOOKUP($O$17,oil,7),\"\"))))))","v":""},{"$f":"IF(AND(Entry!$S$5=1,Database!$C$336>='A&M'!L4),0,IF(Database!$C$336>='A&M'!L4,0,IF($Q$35=5,VLOOKUP($O$18,veggies,7),IF($Q$35=6,VLOOKUP($O$19,rowcropsandgrain,7),IF($Q$35=7,VLOOKUP($O$20,turf,7),IF($Q$35=8,VLOOKUP($O$21,fiber,7),\"\"))))))","v":""},"P"]
["1. Nitrogen from previous legume crop",null,null,null,null,null,null,null,null,null,null,null,null,null,null,null,null,null,{"$f":"IF(Database!$C$337>='A&M'!L5,0,IF($Q$35=1,VLOOKUP($O$14,establish,10),IF($Q$35=2,VLOOKUP($O$15,lawnandgarden,10),IF($Q$35=3,VLOOKUP($O$16,forages,10),IF($Q$35=4,VLOOKUP($O$17,oil,10),\"\")))))","v":""},{"$f":"IF(Database!$C$337>='A&M'!L5,0,IF($Q$35=5,VLOOKUP($O$18,veggies,10),IF($Q$35=6,VLOOKUP($O$19,rowcropsandgrain,10),IF($Q$35=7,VLOOKUP($O$20,turf,10),IF($Q$35=8,VLOOKUP($O$21,fiber,10),\"\")))))","v":""},"K"]
["2. Residual from long-term manure application"]
["3. Irrigation water                                                       (Inches X ppm N in water X .226)",null,null,null,null,null,null,null,null,null,null,null,null,null,null,null,{"$f":"IF($P$14>0,1,IF($P$15>0,2,IF($P$16>0,3,IF($P$17>0,4,IF($P$18>0,5,IF($P$19>0,6,IF($P$20>0,7,IF($P$21>0,8,\"\"))))))))","v":""},{"$f":"IF($N$31<>\"\",$N$31,$N$32)","v":""},{"$f":"IF($Q$39=1,VLOOKUP($P$14,establish,5),IF($Q$39=2,VLOOKUP($P$15,lawnandgarden,5),IF($Q$39=3,VLOOKUP($P$16,forages,5),IF($Q$39=4,VLOOKUP($P$17,oil,5),\"\"))))","v":""},{"$f":"IF($Q$39=5,VLOOKUP($P$18,veggies,5),IF($Q$39=6,VLOOKUP($P$19,rowcropsandgrain,5),IF($Q$39=7,VLOOKUP($P$20,turf,5),IF($Q$39=8,VLOOKUP($P$21,fiber,5),\"\"))))","v":""},"N"]
["4. Other sources ",null,null,null,null,null,null,null,null,null,null,null,null,null,null,null,null,null,{"$f":"IF(AND(Entry!$T$5=1,Database!$C$336>='A&M'!L4),0,IF(Database!$C$336>='A&M'!L4,0,IF($Q$39=1,VLOOKUP($P$14,establish,7),IF($Q$39=2,VLOOKUP($P$15,lawnandgarden,7),IF($Q$39=3,VLOOKUP($P$16,forages,7),IF($Q$39=4,VLOOKUP($P$17,oil,7),\"\"))))))","v":""},{"$f":"IF(AND(Entry!$T$5=1,Database!$C$336>='A&M'!L4),0,IF(Database!$C$336>='A&M'!L4,0,IF($Q$39=5,VLOOKUP($P$18,veggies,7),IF($Q$39=6,VLOOKUP($P$19,rowcropsandgrain,7),IF($Q$39=7,VLOOKUP($P$20,turf,7),IF($Q$39=8,VLOOKUP($P$21,fiber,7),\"\"))))))","v":""},"P"]
["Plant-Available Nutrients                         Applied to Field",null,null,null,"N",null,"P2O5",null,"K2O",null,null,null,null,null,null,null,null,null,{"$f":"IF(Database!$C$337>='A&M'!L5,0,IF($Q$39=1,VLOOKUP($P$14,establish,10),IF($Q$39=2,VLOOKUP($P$15,lawnandgarden,10),IF($Q$39=3,VLOOKUP($P$16,forages,10),IF($Q$39=4,VLOOKUP($P$17,oil,10),\"\")))))","v":""},{"$f":"IF(Database!$C$337>='A&M'!L5,0,IF($Q$39=5,VLOOKUP($P$18,veggies,10),IF($Q$39=6,VLOOKUP($P$19,rowcropsandgrain,10),IF($Q$39=7,VLOOKUP($P$20,turf,10),IF($Q$39=8,VLOOKUP($P$21,fiber,10),\"\")))))","v":""},"K"]
["5. Starter Fertilizern (if any)"]
["6. Other"]
["7. Subtotal (sum of lines 1 - 6)",null,null,null,{"$f":"SUM(E37:E43)","v":0},null,{"$f":"SUM(G39:G43)","v":0},null,{"$f":"SUM(I39:I43)","v":0},null,null,null,null,null,null,null,"establish"]
[null,null,null,null,null,null,null,null,null,null,null,null,null,null,null,null,"lawnandgarden"]
[null,null,null,null,null,null,null,null,null,null,null,null,null,null,null,null,"forages"]
[null,null,null,null,null,null,null,null,null,null,null,null,null,null,null,null,"oil"]
[null,null,null,null,null,null,null,null,null,null,null,null,null,null,null,null,"veggies"]
[null,null,null,null,null,null,null,null,null,null,null,null,null,null,null,null,"rowcropsandgrain"]
[null,null,null,null,null,null,null,null,null,null,null,null,null,null,null,null,"turf"]
[null,null,null,null,null,null,null,null,null,null,null,null,null,null,null,null,"fiber"]
[]
[{"$f":"\"Year 2  -  ( \"&$C$4+1&\" )\"","v":"Year 2  -  ( 2008 )"}]
["Credits",null,null,null,"N",null,"P2O5",null,"K2O"]
["1. Nitrogen from previous legume crop"]
["2. Residual from long-term manure application"]
["3. Irrigation water                                                       (Inches X ppm N in water X .226)"]
["4. Other sources "]
["Plant-Available Nutrients                         Applied to Field",null,null,null,"N",null,"P2O5",null,"K2O"]
["5. Starter Fertilizern (if any)"]
["6. Other"]
["7. Subtotal (sum of lines 1 - 6)",null,null,null,{"$f":"SUM(E55:E61)","v":0},null,{"$f":"SUM(G57:G61)","v":0},null,{"$f":"SUM(I57:I61)","v":0}]
[]
[]
[]
[]
[]
[]
[]
[]
[{"$f":"\"Year 3  -  ( \"&$C$4+2&\" )\"","v":"Year 3  -  ( 2009 )"}]
["Credits",null,null,null,"N",null,"P2O5",null,"K2O"]
["1. Nitrogen from previous legume crop"]
["2. Residual from long-term manure application"]
["3. Irrigation water                                                       (Inches X ppm N in water X .226)"]
["4. Other sources "]
["Plant-Available Nutrients                         Applied to Field",null,null,null,"N",null,"P2O5",null,"K2O"]
["5. Starter Fertilizern (if any)"]
["6. Other"]
["7. Subtotal (sum of lines 1 - 6)",null,null,null,{"$f":"SUM(E73:E79)","v":0},null,{"$f":"SUM(G75:G79)","v":0},null,{"$f":"SUM(I75:I79)","v":0}]
[]
[]
[]
[]
[]
[]
[]
[]
[{"$f":"\"Year 4  -  ( \"&$C$4+3&\" )\"","v":"Year 4  -  ( 2010 )"}]
["Credits",null,null,null,"N",null,"P2O5",null,"K2O"]
["1. Nitrogen from previous legume crop"]
["2. Residual from long-term manure application"]
["3. Irrigation water                                                       (Inches X ppm N in water X .226)"]
["4. Other sources "]
["Plant-Available Nutrients                         Applied to Field",null,null,null,"N",null,"P2O5",null,"K2O"]
["5. Starter Fertilizern (if any)"]
["6. Other"]
["7. Subtotal (sum of lines 1 - 6)",null,null,null,{"$f":"SUM(E91:E97)","v":0},null,{"$f":"SUM(G93:G97)","v":0},null,{"$f":"SUM(I93:I97)","v":0}]
[]
[]
[]
[]
[]
[]
[]
[]
[{"$f":"\"Year 5  -  ( \"&$C$4+4&\" )\"","v":"Year 5  -  ( 2011 )"}]
["Credits",null,null,null,"N",null,"P2O5",null,"K2O"]
["1. Nitrogen from previous legume crop"]
["2. Residual from long-term manure application"]
["3. Irrigation water                                                       (Inches X ppm N in water X .226)"]
["4. Other sources "]
["Plant-Available Nutrients                         Applied to Field",null,null,null,"N",null,"P2O5",null,"K2O"]
["5. Starter Fertilizern (if any)"]
["6. Other"]
["7. Subtotal (sum of lines 1 - 6)",null,null,null,{"$f":"SUM(E109:E115)","v":0},null,{"$f":"SUM(G111:G115)","v":0},null,{"$f":"SUM(I111:I115)","v":0}]
[]
[]
[]
[]
[]
[]
[]
[]
[]
[]
[]
[]
[null,null,"Residue Type",null,"Amount"]
[]
["Year 1",null,"Crop Residue",null,{"$f":"IF($O$131=\"\",\"\",$O$131)","v":""},{"$f":"IF(OR($E$131=\"\",$P$131=\"\"),\"\",VLOOKUP($P$131,$M$131:$N$142,2))","v":""},null,null,null,null,null,null,1,1000,null,null,{"$f":"IF($F$131=\"\",0,($F$131/2000*10))","v":0}]
[null,null,"or",null,null,null,null,null,null,null,null,null,2,2000]
[null,null,"Cover Crop / Green Manure",null,{"$f":"IF($O$133=\"\",\"\",$O$133)","v":""},{"$f":"IF(OR($E$133=\"\",$P$133=\"\"),\"\",VLOOKUP($P$133,$M$131:$N$142,2))","v":""},null,null,null,null,null,null,3,3000,null,null,{"$f":"IF($F$133=\"\",0,($F$133/2000*5))","v":0}]
[null,null,null,null,null,null,null,null,null,null,null,null,4,4000]
["Year 2",null,"Crop Residue",null,{"$f":"IF($O$135=\"\",\"\",$O$135)","v":""},{"$f":"IF(OR($E$135=\"\",$P$135=\"\"),\"\",VLOOKUP($P$135,$M$131:$N$142,2))","v":""},null,null,null,null,null,null,5,5000,null,null,{"$f":"IF($F$135=\"\",0,($F$135/2000*10))","v":0}]
[null,null,"or",null,null,null,null,null,null,null,null,null,6,6000]
[null,null,"Cover Crop / Green Manure",null,{"$f":"IF($O$137=\"\",\"\",$O$137)","v":""},{"$f":"IF(OR($E$137=\"\",$P$137=\"\"),\"\",VLOOKUP($P$137,$M$131:$N$142,2))","v":""},null,null,null,null,null,null,7,7000,null,null,{"$f":"IF($F$137=\"\",0,($F$137/2000*5))","v":0}]
[null,null,null,null,null,null,null,null,null,null,null,null,8,8000]
["Year 3",null,"Crop Residue",null,{"$f":"IF($O$139=\"\",\"\",$O$139)","v":""},{"$f":"IF(OR($E$139=\"\",$P$139=\"\"),\"\",VLOOKUP($P$139,$M$131:$N$142,2))","v":""},null,null,null,null,null,null,9,9000,null,null,{"$f":"IF($F$139=\"\",0,($F$139/2000*10))","v":0}]
[null,null,"or",null,null,null,null,null,null,null,null,null,10,10000]
[null,null,"Cover Crop / Green Manure",null,{"$f":"IF($O$141=\"\",\"\",$O$141)","v":""},{"$f":"IF(OR($E$141=\"\",$P$141=\"\"),\"\",VLOOKUP($P$141,$M$131:$N$142,2))","v":""},null,null,null,null,null,null,11,11000,null,null,{"$f":"IF($F$141=\"\",0,($F$141/2000*5))","v":0}]
[null,null,null,null,null,null,null,null,null,null,null,null,12,12000]
["Year 4",null,"Crop Residue",null,{"$f":"IF($O$143=\"\",\"\",$O$143)","v":""},{"$f":"IF(OR($E$143=\"\",$P$143=\"\"),\"\",VLOOKUP($P$143,$M$131:$N$142,2))","v":""},null,null,null,null,null,null,null,null,null,null,{"$f":"IF($F$143=\"\",0,($F$143/2000*10))","v":0}]
[null,null,"or"]
[null,null,"Cover Crop / Green Manure",null,{"$f":"IF($O$145=\"\",\"\",$O$145)","v":""},{"$f":"IF(OR($E$145=\"\",$P$145=\"\"),\"\",VLOOKUP($P$145,$M$131:$N$142,2))","v":""},null,null,null,null,null,null,null,null,null,null,{"$f":"IF($F$145=\"\",0,($F$145/2000*5))","v":0}]
[]
["Year 5",null,"Crop Residue",null,{"$f":"IF($O$147=\"\",\"\",$O$147)","v":""},{"$f":"IF(OR($E$147=\"\",$P$147=\"\"),\"\",VLOOKUP($P$147,$M$131:$N$142,2))","v":""},null,null,null,null,null,null,null,null,null,null,{"$f":"IF($F$147=\"\",0,($F$147/2000*10))","v":0}]
[null,null,"or"]
[null,null,"Cover Crop / Green Manure",null,{"$f":"IF($O$149=\"\",\"\",$O$149)","v":""},{"$f":"IF(OR($E$149=\"\",$P$149=\"\"),\"\",VLOOKUP($P$149,$M$131:$N$142,2))","v":""},null,null,null,null,null,null,null,null,null,null,{"$f":"IF($F$149=\"\",0,($F$149/2000*5))","v":0}]
[]
[null,null,null,null,null,null,null,null,null,null,null,null,null,null,null,{"$f":"SUM(P131:P149)","v":0}]

{"sheet":"Specs","index":4,"n_rows":154,"n_cols":6,"rows_kept":154,"cut":false,"hidden":false,"merged":[]}
[]
[{"$f":"+\"YEAR   1                 ( \"&Entry!$C$4&\" )\"","v":"YEAR   1                 ( 2007 )"},null,null,{"$f":"IF(A6=\"auto recommendation used\",\"\",\"Over-ride Values\")","v":""}]
[{"$f":"+\"Crop / Grass Species and Yield:           \"&IF(Entry!$B$22=\"\",\"None Selected\",Entry!$B$22)","v":"Crop / Grass Species and Yield:           Corn 200 bu"},{"$f":"IF(A6=\"auto recommendation used\",\"\",\"N\")","v":""},{"$f":"IF(A6=\"auto recommendation used\",\"\",\"P2O5\")","v":""},{"$f":"IF(A6=\"auto recommendation used\",\"\",\"K2O\")","v":""}]
[null,null,null,null,null,"Over-ride auto recommendation. Enter adjusted recommendation to the right; explain in specifications."]
[{"$f":"+\"pH level as identified by soil test:                     \"&IF(AND(Entry!$H$2=\"\",Entry!$H$3=\"\",Entry!$H$4=\"\"),\"\",IF(TAMU!$A$3<>\"\",TAMU!$A$3,IF(#REF!<>\"\",#REF!,IF(#REF!<>\"\",#REF!,IF(#REF!<>\"\",#REF!,IF(#REF!<>\"\",#REF!,\"error\"))))))&\"                           Lime:         \"&IF(Entry!$H$22=\"\",\"\",Entry!$H$22)&\"       \"&IF(Entry!$H$22=\"\",\"\",IF(Entry!$H$22>1,\"Tons\",\"Ton\"))","v":"pH level as identified by soil test:                     5.6                           Lime:         1       Ton"}]
[{"$f":"IF(A4=\"\",\"Auto Recommendation Used\",\"Manual Over-ride Used for Year 1\")","v":"Auto Recommendation Used"},null,null,null,null,{"$f":"Entry!$H$3","v":""}]
[{"$f":"+\"Recommended nutrient application to meet yield goal:             \"&IF(OR(Entry!$B$22=\"\",A4=\"Over-ride auto recommendation. Enter adjusted recommendation to the right; explain in specifications.\"),(B4&\" - \"&C4&\" - \"&D4)&\"         =      \"&IF(Entry!$H$3=\"x\",\"( Establishment Rate )\",IF(Entry!$H$2=\"x\",\"( Soil Test Rate )\",IF(Entry!$H$4=\"x\",\"( Grass Production Rate )\",\"\"))),(Entry!E22&\" - \"&Entry!F22&\" - \"&Entry!G22)&\"         =      \"&IF(Entry!$H$3=\"x\",\"( Establishment Rate )\",IF(Entry!$H$2=\"x\",\"( Soil Test Rate )\",IF(Entry!$H$4=\"x\",\"( Grass Production Rate )\"))))","v":"Recommended nutrient application to meet yield goal:             245 - 115 - 120         =      ( Soil Test Rate )"},null,null,null,null,{"$f":"Entry!I22","v":""}]
[{"$f":"IF(Entry!$H$3=\"\",\"\",+\"After emergence/rooting, topdress with extra NITROGEN:      \"&IF(Entry!$L$14>0,VLOOKUP(Entry!$L$14,establish,16)&\"  \"&\"Units of Actual N\"))","v":""}]
[{"$f":"+\"Defined purpose\"&IF(COUNTA(Entry!$P$2:$P$5)>1,\"s :  \",\" :  \")&IF(Entry!$F$2=\"x\",\"Optimum Yield\",\"\")&IF(Entry!$F$3=\"x\",IF(Entry!$F$2=\"x\",\",  Quick Cover\",\"  Quick Cover\"),\"\")&IF(Entry!$F$4=\"x\",IF(OR(Entry!$F$2=\"x\",Entry!$F$3=\"x\"),\",  Water Quality\",\"  Water Quality\"),\"\")&IF(Entry!$F$5=\"x\",IF(OR(Entry!$F$2=\"x\",Entry!$F$3=\"x\",Entry!$F$4=\"x\"),\",  Soil Condition\",\"  Soil Condition\"),\"\")","v":"Defined purpose :  Optimum Yield"}]
["Specifications (including sensitive areas)"]
["Method, Form, Timing of Application and other notes:"]
[null,"See below for example narratives"]
[]
[]
[]
[]
[]
[]
[]
[]
[]
[]
[]
[{"$f":"\"YEAR   2                  ( \"&Entry!$C$4+1&\" )\"","v":"YEAR   2                  ( 2008 )"}]
[{"$f":"+\"Crop / Grass Species and Yield:           \"&IF(Entry!$B$23=\"\",\"None Selected\",Entry!$B$23)","v":"Crop / Grass Species and Yield:           Corn 100 bu"}]
[]
[{"$f":"+\"pH level as identified by soil test:                     \"&IF(AND(Entry!$H$2=\"\",Entry!$H$3=\"\",Entry!$H$4=\"\"),\"\",IF(TAMU!$A$3<>\"\",TAMU!$A$3,IF(#REF!<>\"\",#REF!,IF(#REF!<>\"\",#REF!,IF(#REF!<>\"\",#REF!,IF(#REF!<>\"\",#REF!,\"error\"))))))&\"                           Lime:         \"&IF(Entry!$H$23=\"\",\"\",Entry!$H$23)&\"       \"&IF(Entry!$H$23=\"\",\"\",IF(Entry!$H$23>1,\"Tons\",\"Ton\"))","v":"pH level as identified by soil test:                     5.6                           Lime:                "}]
[]
[{"$f":"+\"Annual Crop Requirement not to Exceed:             \"&IF(Entry!$B$23=\"\",\"\",Entry!$E$23&\" - \"&Entry!$F$23&\" - \"&Entry!$G$23)&\"         =          \"&IF(Entry!$H$3=\"x\",\"( Grass Production Rate )\",IF(Entry!$H$2=\"x\",\"( Crop Rate )\",IF(Entry!$H$4=\"x\",\"( Grass Production Rate )\",\"\")))","v":"Annual Crop Requirement not to Exceed:             120 - 80 - 110         =          ( Crop Rate )"}]
[]
[{"$f":"+\"Defined purpose\"&IF(COUNTA(Entry!$P$2:$P$5)>1,\"s :  \",\" :  \")&IF(Entry!$F$2=\"x\",\"Optimum Yield\",\"\")&IF(Entry!$F$3=\"x\",IF(Entry!$F$2=\"x\",\",  Quick Cover\",\"  Quick Cover\"),\"\")&IF(Entry!$F$4=\"x\",IF(OR(Entry!$F$2=\"x\",Entry!$F$3=\"x\"),\",  Water Quality\",\"  Water Quality\"),\"\")&IF(Entry!$F$5=\"x\",IF(OR(Entry!$F$2=\"x\",Entry!$F$3=\"x\",Entry!$F$4=\"x\"),\",  Soil Condition\",\"  Soil Condition\"),\"\")","v":"Defined purpose :  Optimum Yield"}]
["Specifications (including sensitive areas)"]
["Method, Form, Timing of Application and other notes:"]
[]
[]
[]
[]
[]
[]
[]
[]
[]
[]
[]
[]
[{"$f":"\"YEAR   3                   ( \"&Entry!$C$4+2&\" )\"","v":"YEAR   3                   ( 2009 )"}]
[{"$f":"+\"Crop / Grass Species and Yield:           \"&IF(Entry!$B$24=\"\",\"None Selected\",Entry!$B$24)","v":"Crop / Grass Species and Yield:           Bermudagrass, Hyb, Hay  12000 lb"}]
[]
[{"$f":"+\"pH level as identified by soil test:                     \"&IF(AND(Entry!$H$2=\"\",Entry!$H$3=\"\",Entry!$H$4=\"\"),\"\",IF(TAMU!$A$3<>\"\",TAMU!$A$3,IF(#REF!<>\"\",#REF!,IF(#REF!<>\"\",#REF!,IF(#REF!<>\"\",#REF!,IF(#REF!<>\"\",#REF!,\"error\"))))))&\"                           Lime:         \"&IF(Entry!$H$24=\"\",\"\",Entry!$H$24)&\"       \"&IF(Entry!$H$24=\"\",\"\",IF(Entry!$H$24>1,\"Tons\",\"Ton\"))","v":"pH level as identified by soil test:                     5.6                           Lime:                "}]
[]
[{"$f":"+\"Annual Crop Requirement not to Exceed:             \"&IF(Entry!$B$24=\"\",\"\",Entry!$E$24&\" - \"&Entry!$F$24&\" - \"&Entry!$G$24)&\"         =          \"&IF(Entry!$H$3=\"x\",\"( Grass Production Rate )\",IF(Entry!$H$2=\"x\",\"( Crop Rate )\",IF(Entry!$H$4=\"x\",\"( Grass Production Rate )\",\"\")))","v":"Annual Crop Requirement not to Exceed:             300 - 140 - 250         =          ( Crop Rate )"}]
[]
[{"$f":"+\"Defined purpose\"&IF(COUNTA(Entry!$P$2:$P$5)>1,\"s :  \",\" :  \")&IF(Entry!$F$2=\"x\",\"Optimum Yield\",\"\")&IF(Entry!$F$3=\"x\",IF(Entry!$F$2=\"x\",\",  Quick Cover\",\"  Quick Cover\"),\"\")&IF(Entry!$F$4=\"x\",IF(OR(Entry!$F$2=\"x\",Entry!$F$3=\"x\"),\",  Water Quality\",\"  Water Quality\"),\"\")&IF(Entry!$F$5=\"x\",IF(OR(Entry!$F$2=\"x\",Entry!$F$3=\"x\",Entry!$F$4=\"x\"),\",  Soil Condition\",\"  Soil Condition\"),\"\")","v":"Defined purpose :  Optimum Yield"}]
["Specifications (including sensitive areas)"]
["Method, Form, Timing of Application and other notes:"]
[]
[]
[]
[]
[]
[]
[]
[]
[]
[]
[]
[]
[{"$f":"\"YEAR   4                   ( \"&Entry!$C$4+3&\" )\"","v":"YEAR   4                   ( 2010 )"}]
[{"$f":"+\"Crop / Grass Species and Yield:           \"&IF(Entry!$B$25=\"\",\"None Selected\",Entry!$B$25)","v":"Crop / Grass Species and Yield:           Do Not Select Crop"}]
[]
[{"$f":"+\"pH level as identified by soil test:                     \"&IF(AND(Entry!$H$2=\"\",Entry!$H$3=\"\",Entry!$H$4=\"\"),\"\",IF(TAMU!$A$3<>\"\",TAMU!$A$3,IF(#REF!<>\"\",#REF!,IF(#REF!<>\"\",#REF!,IF(#REF!<>\"\",#REF!,IF(#REF!<>\"\",#REF!,\"error\"))))))&\"                           Lime:         \"&IF(Entry!$H$25=\"\",\"\",Entry!$H$25)&\"       \"&IF(Entry!$H$25=\"\",\"\",IF(Entry!$H$25>1,\"Tons\",\"Ton\"))","v":"pH level as identified by soil test:                     5.6                           Lime:                "}]
[]
[{"$f":"+\"Recommended nutrient application to meet yield goal:             \"&IF(Entry!$B$25=\"\",\"\",Entry!$E$25&\" - \"&Entry!$F$25&\" - \"&Entry!$G$25)&\"         =          \"&IF(Entry!$H$3=\"x\",\"( Grass Production Rate )\",IF(Entry!$H$2=\"x\",\"( Crop Rate )\",IF(Entry!$H$4=\"x\",\"( Grass Production Rate )\",\"\")))","v":"Recommended nutrient application to meet yield goal:              -  -          =          ( Crop Rate )"}]
[]
[{"$f":"+\"Defined purpose\"&IF(COUNTA(Entry!$P$2:$P$5)>1,\"s :  \",\" :  \")&IF(Entry!$F$2=\"x\",\"Optimum Yield\",\"\")&IF(Entry!$F$3=\"x\",IF(Entry!$F$2=\"x\",\",  Quick Cover\",\"  Quick Cover\"),\"\")&IF(Entry!$F$4=\"x\",IF(OR(Entry!$F$2=\"x\",Entry!$F$3=\"x\"),\",  Water Quality\",\"  Water Quality\"),\"\")&IF(Entry!$F$5=\"x\",IF(OR(Entry!$F$2=\"x\",Entry!$F$3=\"x\",Entry!$F$4=\"x\"),\",  Soil Condition\",\"  Soil Condition\"),\"\")","v":"Defined purpose :  Optimum Yield"}]
["Specifications (including sensitive areas)"]
["Method, Form, Timing of Application and other notes:"]
[]
[]
[]
[]
[]
[]
[]
[]
[]
[]
[]
[]
[{"$f":"\"YEAR   5                   ( \"&Entry!$C$4+4&\" )\"","v":"YEAR   5                   ( 2011 )"}]
[{"$f":"+\"Crop / Grass Species and Yield:           \"&IF(Entry!$B$26=\"\",\"None Selected\",Entry!$B$26)","v":"Crop / Grass Species and Yield:           Do Not Select Crop"}]
[]
[{"$f":"+\"pH level as identified by soil test:                     \"&IF(AND(Entry!$H$2=\"\",Entry!$H$3=\"\",Entry!$H$4=\"\"),\"\",IF(TAMU!$A$3<>\"\",TAMU!$A$3,IF(#REF!<>\"\",#REF!,IF(#REF!<>\"\",#REF!,IF(#REF!<>\"\",#REF!,IF(#REF!<>\"\",#REF!,\"error\"))))))&\"                           Lime:         \"&IF(Entry!$H$26=\"\",\"\",Entry!$H$26)&\"       \"&IF(Entry!$H$26=\"\",\"\",IF(Entry!$H$26>1,\"Tons\",\"Ton\"))","v":"pH level as identified by soil test:                     5.6                           Lime:                "}]
[]
[{"$f":"+\"Recommended nutrient application to meet yield goal:             \"&IF(Entry!$B$26=\"\",\"\",Entry!$E$26&\" - \"&Entry!$F$26&\" - \"&Entry!$G$26)&\"         =          \"&IF(Entry!$H$3=\"x\",\"( Grass Production Rate )\",IF(Entry!$H$2=\"x\",\"( Crop Rate )\",IF(Entry!$H$4=\"x\",\"( Grass Production Rate )\",\"\")))","v":"Recommended nutrient application to meet yield goal:              -  -          =          ( Crop Rate )"}]
[]
[{"$f":"+\"Defined purpose\"&IF(COUNTA(Entry!$P$2:$P$5)>1,\"s :  \",\" :  \")&IF(Entry!$F$2=\"x\",\"Optimum Yield\",\"\")&IF(Entry!$F$3=\"x\",IF(Entry!$F$2=\"x\",\",  Quick Cover\",\"  Quick Cover\"),\"\")&IF(Entry!$F$4=\"x\",IF(OR(Entry!$F$2=\"x\",Entry!$F$3=\"x\"),\",  Water Quality\",\"  Water Quality\"),\"\")&IF(Entry!$F$5=\"x\",IF(OR(Entry!$F$2=\"x\",Entry!$F$3=\"x\",Entry!$F$4=\"x\"),\",  Soil Condition\",\"  Soil Condition\"),\"\")","v":"Defined purpose :  Optimum Yield"}]
["Specifications (including sensitive areas)"]
["Method, Form, Timing of Application and other notes:"]
[]
[]
[]
[]
[]
[]
[]
[]
[]
[]
[]
[]
["      SPLIT APPLICATION RECOMMENDATIONS"]
["NITROGEN TIMING - When the production target is higher than "]
["than the minimum amount, the total amount of nitrogen has"]
["already been adjusted on the following crops to reflect the higher"]
["production.  The following is the normal A&M recommendation for "]
["split-application of the nitrogen."]
[]
["Species                                                            Apply units of N"]
["Bahiagrass after each grazing period                                   40"]
["Bahiagrass, hay, after each cutting                                     70"]
["Bermudagrass, Common, after each grazing period            40"]
["Bermudagrass, Common, hay, after each cutting               70"]
["Bermudagrass, Improved, after each grazing period          60"]
["Bermudagrass, Improved, Hay after each cutting             100"]
["Bluestems, Introduced, after each grazing period              40"]
["Buffelgrass after each cutting                                             70"]
["Indiangrass after each grazing period                                30"]
["Kleingrass after each grazing period                                   30"]
["Lovegrass after each grazing period                                   40"]
["Switchgrass after each grazing period                                30"]
[]
["POTASSIUM TIMING - Any time more than 150 # of K20 is to be applied, it should be split-applied."]
["Grass Establishment - Commercial Fertilizer: Broadcast all recommended nutrients before planting, if weed competition is expected to be high, apply recommended nitrogen (N) after germination or green up of desired species. If soil test P & K levels are V. Low  to Moderate the P and K applied should be incorporated as part of final seedbed preparation. Recommended lime should be applied at least 6 months before planting. Do not exceed annual soil test recommended or crop requirement of N or P by more than 10%. Additional (     lb/ac) Nitrogen for establishment will be applied after desired species has attained 75% cover of the planted area. Additional N and potassium for production should be applied in split applications according to number of planned grazing or haying periods, and shall be applied as close to beginning of new growth as feasible (green up in spring or after each grazing or haying). Total establishment year N application for production will not exceed the year 2 crop N requirement."]
["Annual Legume Establishment-1 - Commercial Fertilizer: Broadcast. Recommended lime should be applied at least 6 months before planting. Do not exceed annual soil test recommended or crop requirement of P by more than 10%. No nitrogen (N) will be applied in the cool season unless blended fertilizer is not available (see note in Fertilizer Rates section). Phosphorus will be applied before planting or green up in the fall. Potassium should be applied in split applications according to how may grazing periods are planned, and shall be applied as close to the beginning of new growth as feasible (Prior to Greenup in the fall and after each grazing). If the legume seeding or re-seeding is successful, N application for the base grass should be reduced by 60 to 80 lbs/ac each following year. "]
["Annual Legume Establishment-2 - Commercial Fertilizer: Broadcast. Recommended lime should be applied at least 6 months before planting. WHEN CUSTOM BLENDED FERTILIZER without NITROGEN is not available. THE AVAILABLE PRE-BLEND WITH THE LOWEST AMOUNT  NITROGEN WILL BE USED, Do not exceed annual crop requirement for Phosphorus by more than 10% and: If the P and/or K levels are V. LOW or LOW, the pre-blend containing nitrogen and P and/or K for legume establishment should be applied with the last fertilization of the base grass if over seeded, or at least 2 weeks prior to seedbed preparation if planted on a prepared seedbed.  If the P and/or K levels are MODERATE or HIGHER; the pre-blend containing nitrogen and P and/or K for legume establishment should be applied sometime after the legume has germinated and before it makes its peak growth in the spring. If the legume seeding or re-seeding is successful, N application for the base grass should be reduced by 60 to 80 lbs/ac each following year. "]
["Grass Maintenance and Production - Commercial Fertilizer: Broadcast. Do not exceed annual soil test recommended or crop requirement of N or P by more than 10%. All recommended phosphorus should be applied at green up. Nitrogen and potassium should be applied in split applications according to number of planned grazing or haying periods, and shall be applied as close to initiation of new growth as feasible (green up in spring or after each grazing or haying). If a legume seeding or re-seeding is successful, N application for the base grass should be reduced by 60 to 80 lbs/ac each following year. "]
["Other cropland examples."]
["Cotton Production <1 bale: Commercial fertilizer: broadcast and/or incorporate all of annual N and all P2O5 and K2O at planting or slightly before planting.Do not exceed annual soil test recommended or crop requirement of N or P by more than 10%."]
["Cotton production >1 bale: Commercial fertilizer, broadcast and/or incorporate about 20% of the recommended nitrogen and all P2O5 and K2O at planting. Sidedress about 40% of the recommended nitrogen after squaring begins if cotton is pale green in color. If not delay sidedress until first bloom. Monitor nitrates with petiole leaf test, or visual observation beginning one week before bloom. Sidedress with remaining N if petiole test indicates need, or visual observation (pale green) suggests need for additional N. Final N application should be adjusted based on weather conditions and/or availability of irrigation water to insure the yield goal can be meet or exceeded. Do not exceed annual soil test recommended or crop requirement of N or P by more than 10%."]
["Corn Production <110 bu: Commercial fertilizer: broadcast and/or incorporate annual N, P2O5, and K2O at or slightly before planting.Do not exceed annual soil test recommended or crop requirement of N or P by more than 10%."]
["Corn Production >110 bu: Commercial fertilizer: broadcast and/or incorporate about 60 - 70% of annual nitrogen and all P2O5 and K2O at or slightly before planting. Sidedress remaining N when corn is 10 - 12 inches high (20 - 30 days after emergence).Do not exceed annual soil test or crop requirement of N or P by more than 10%."]
["Corn or Sorghum Silage: Commercial fertilizer, broadcast and/or incorporate about 50% nitrogen and all P2O5, and K2O at or slightly before planting. Broadcast remaining N prior to initiation of the 5th leaf. Do not exceed annual soil test recommended or crop requirement of N or P by more than 10%."]
["Hay Grazer, Forage Sorg, etc. 1 cutting or light grazing: Commercial fertilizer, broadcast and/or incorporate all annual nitrogen, P2O5, and K2O at or slightly before planting.Do not exceed annual soil test recommended or crop requirement of N or P by more than 10%."]
["Hay Grazer, Forage Sorg, etc. 2 cutting or heavy grazing: Commercial fertilizer, broadcast and/or incorporate about 60% of annual nitrogen, and all P2O5, and K2O at or slightly before planting. Apply remaining about 40% N after first cutting or grazing period.Do not exceed annual soil test recommended or crop requirement of N or P by more than 10%."]
["Hay Grazer, Forage Sorg, etc. 3 cutting or moderate grazing: Commercial fertilizer, broadcast and/or incorporate about 45% of annual nitrogen, and all P2O5, and K2O at or slightly before planting. Apply about 30% of annual N after first cutting or grazing period, and remaining N after second cutting. Do not exceed annual soil test recommended or crop requirement of N or P by more than 10%."]
["Rice (single crop), apply all P & K and about 90 - 120 lb/ac N before flood. Apply about 60 lb/ac N between boot and 5% heading to reduce lodging increase main crop yield and milling. Do not exceed annual soil test recommended or crop requirement of N or P by more than 10%."]
["Rice plus ratoon, apply all P & K and about 90 - 120 lb/ac N before flood. Apply about 60 lb/ac N between boot and 5% heading to reduce lodging increase main crop yield and milling plus improve ratoon yields. Split ratoon crop N application if dry period between main & ratoon crop will be 10 - 25 days, otherwise apply all ratoon crop N at before ratoon flood. Do not exceed annual soil test recommended or crop requirement of N or P by more than 10%."]
["Rice Fallow land: no fertilizer unless production is needed for grazing. Do not exceed annual soil test recommended or crop requirement of N or P by more than 10%.","If fallow is grazed select native grazing from"]
["Small Grain Grazing All yield levels: Commercial fertilizer, broadcast and/or incorporate 30 to 40% of annual nitrogen and all P2O5, and K2O at or slightly before planting. Broadcast about 30% of annual nitrogen in late fall and remaining annual nitrogen in late winter, if needed. Do not exceed annual soil test recommended or crop requirement of N or P by more than 10%.","forage category for the crop and grass Maint. From specs."]
["Soybean: Commercial fertilizer, band, broadcast and/or incorporate all P2O5, and K2O at or slightly before planting. Do not exceed annual soil test recommended or crop requirement of N or P by more than 10%."]
["Wheat Grain Plus Grazing: Commercial fertilizer, broadcast and/or incorporate about 30 - 40%nitrogen and all P2O5, and K2O at or slightly before planting. Broadcast about 30% of annual nitrogen in late fall, if additional grazing is needed, and broadcast the remaining N after cattle removal, and prior to jointing to produce grain crop. Do not exceed annual soil test recommended or crop requirement of N or P by more than 10%."]
["Wheat Grain Only <60 bu: Commercial fertilizer, broadcast and/or incorporate All annual nitrogen, P2O5, and K2O at or slightly before planting. Do not exceed annual soil test recommended or crop requirement of N or P by more than 10%."]
["Wheat Grain Only >60 bu: Commercial fertilizer, broadcast and/or incorporate about 50 - 60% of annual nitrogen and all P2O5, and K2O at or slightly before planting. Broadcast the remaining lb/ac nitrogen prior to jointing. Do not exceed annual soil test recommended or crop requirement of N or P by more than 10%."]

{"sheet":"Database","index":5,"n_rows":699,"n_cols":26,"rows_kept":699,"cut":false,"hidden":false,"merged":[[338,3,340,3],[338,9,340,9],[338,4,340,4],[338,8,340,8],[338,5,340,5],[0,8,2,8],[1,13,1,15],[0,9,2,9],[0,10,2,10],[338,10,340,10],[338,11,340,11],[0,7,2,7],[338,6,340,6],[338,7,340,7],[0,0,2,0],[0,11,2,11],[0,1,2,1],[0,3,2,3],[0,4,2,4],[0,6,2,6],[0,5,2,5]]}
[null,"A & M Web Page Data 1/","Units","NO3-N ppm","Max        N         lbs","Recom lbs / unit","P rate","P Factor","Recom lbs / unit","K rate","K Factor","Recom lbs / unit",null,23,24,25]
[null,null,"A = Ac",null,null,null,null,null,null,null,null,null,null,"2nd Application of N"]
[null,null,"S = SF",null,null,null,null,null,null,null,null,null,"nutrient","Constant","Adjust.","Calculated"]
[1," AFRICAN MILLET  ","A",30,60,null,55,1.1000000000000001,null,40,0.32]
[{"$f":"A4+1","v":2}," ALFALFA (NON-IRRIGATED) 4 Ton","A",10,20,null,80,1.333,null,120,0.96,null,null,null,null,null,null,null,null,null,null,null,null,null,null,"E"]
[{"$f":"A5+1","v":3}," ALFALFA (IRRIGATED) 6 TON","A",10,20,null,130,2.1669999999999998,null,160,1.28]
[4," ALFALFA (IRRIGATED) 8-12 TON","A",10,20,null,180,3,null,200,1.6]
[5,"Aloe Vera","A",25,50,null,3,0.06,null,40,0.32]
[6,"Apples","AS",20,1,null,38,0.75,null,150,0.95]
[7,"Athletic Fields - Low, Moderate or High Maintenance","A",30,60,null,38,0.75,null,150,0.95]
[8,"Azaleas and Camelias","AS",30,1.4,null,3,0.06,null,0,0]
[9,"Bahiagrass Grazing 1AU/1.5ac","A",110,240,null,65,1.3,null,120,0.96,null,"N"]
[10,"Bahiagrass Grazing 1AU/2ac","A",80,160,null,40,0.8,null,120,0.96,null,"N"]
[11,"Bahiagrass Grazing 1AU/3ac","A",75,150,null,40,0.8,null,100,0.8,null,"ALL",null,null,null,null,null,null,null,null,null,null,null,null,"E"]
[12,"Bahiagrass Grazing 1AU/4ac","A",70,140,null,40,0.8,null,100,0.8,null,"ALL",null,null,null,null,null,null,null,null,null,null,null,null,"E"]
[13,"Bahiagrass Grazing 1AU/5ac","A",50,100,null,30,0.6,null,100,0.8,null,"ALL",null,null,null,null,null,null,null,null,null,null,null,null,"E"]
[14,"Bahiagrass Grazing 1AU/6 + ac","A",30,60,null,30,0.6,null,80,0.64,null,"ALL",null,null,null,null,null,null,null,null,null,null,null,null,"E"]
[15,"Bahiagrass Hay  (1 cutting + grazing)","A",65,130,null,65,1.3,null,120,0.96]
[16,"Bahiagrass Hay  6000 lb","A",70,140,null,40,0.8,null,90,0.72,null,"ALL",null,null,null,null,null,null,null,null,null,null,null,null,"E"]
[17,"Bahiagrass Hay  8000 lb","A",105,210,null,80,1.6,null,180,1.44,null,"N"]
[18,"Bahiagrass Hay  10000 lb","A",210,420,null,110,2.2000000000000002,null,250,1.667,null,"N"]
[19,"Barley 30 - 40 bu","A",25,50,null,55,1.1000000000000001,null,40,0.32]
[20,"Barley 70 - 90 bu","A",50,100,null,80,1.6,null,90,0.71]
[21,"Barley 70 - 90 bu + Light grazing","A",50,100,null,80,1.6,null,90,0.72]
[22,"Barley heavy grazing ","A",80,160,null,105,2.1,null,120,0.96]
[23,"Barley heavy grazing, sandy soils","A",110,220,null,105,2.1,null,120,0.96]
[24,"Beans, Green","A",25,50,null,106,2.13,null,120,0.95]
[25,"Beans, Lima","A",25,50,null,106,2.13,null,120,0.95]
[26,"Beans, Pinto","A",25,50,null,106,2.13,null,120,0.95]
[27,"Beets","A",35,70,null,106,2.13,null,90,0.71]
[28,"Bermudagrass, Common, Grazing  1 AU/1.5 ac","A",120,240,null,65,1.3,null,80,0.64]
[29,"Bermudagrass, Common, Grazing  1 AU/2 ac","A",90,180,null,40,0.8,null,50,0.33300000000000002,null,"N"]
[30,"Bermudagrass, Common, Grazing 1AU/3 ac","A",90,180,null,40,0.8,null,50,0.33300000000000002,null,"N",null,null,null,null,null,null,null,null,null,null,null,null,"E"]
[31,"Bermudagrass, Common, Grazing 1AU/4ac","A",80,160,null,40,0.8,null,50,0.33300000000000002,null,"ALL",null,null,null,null,null,null,null,null,null,null,null,null,"E"]
[32,"Bermudagrass, Common, Grazing 1AU/5ac","A",70,140,null,30,0.6,null,50,0.33300000000000002,null,"ALL",null,null,null,null,null,null,null,null,null,null,null,null,"E"]
[33,"Bermudagrass, Common, Grazing 1AU/6ac","A",50,100,null,30,0.6,null,50,0.33300000000000002,null,"ALL",null,null,null,null,null,null,null,null,null,null,null,null,"E"]
[34,"Bermudagrass, Common, Grazing 1AU/9+ac","A",40,60,null,30,0.6,null,50,0.33300000000000002,null,"ALL",null,null,null,null,null,null,null,null,null,null,null,null,"E"]
[35,"Bermudagrass, Common, Hay (1 cut + grazing)","A",65,130,null,65,1.3,null,90,0.72,null,"N"]
[36,"Bermudagrass, Common, Hay  5000 lb","A",70,140,null,40,0.8,null,100,0.8,null,"N",null,null,null,null,null,null,null,null,null,null,null,null,"E"]
[37,"Bermudagrass, Common, Hay  6000 lb","A",105,210,null,65,1.3,null,170,1.0669999999999999,null,"N",null,null,null,null,null,null,null,null,null,null,null,null,"E"]
[38,"Bermudagrass, Common, Hay  8000 lb","A",140,280,null,80,1.6,null,240,1.0669999999999999,null,"N"]
[39,"Bermudagrass, Common, Hay  9500 lb","A",210,420,null,80,1.6,null,310,1.409,null,"N",null,null,null,null,null,null,null,null,null,null,null,null,"E"]
[40,"Bermudagrass, Hyb, Grazing 1 AU/.5ac","A",150,300,null,65,1.6,null,120,0.96,null,"ALL"]
[41,"Bermudagrass, Hyb, Grazing 1 AU/1ac","A",135,270,null,65,1.6,null,120,0.96,null,"ALL"]
[42,"Bermudagrass, Hyb, Grazing 1AU/2ac","A",100,200,null,65,1.6,null,120,0.96,null,"ALL",null,null,null,null,null,null,null,null,null,null,null,null,"E"]
[43,"Bermudagrass, Hyb, Grazing 1AU/3ac","A",80,160,null,65,1.3,null,120,0.96,null,"ALL",null,null,null,null,null,null,null,null,null,null,null,null,"E"]
[44,"Bermudagrass, Hyb, Grazing 1AU/4ac","A",60,120,null,65,1.3,null,100,0.8,null,"ALL",null,null,null,null,null,null,null,null,null,null,null,null,"E"]
[45,"Bermudagrass, Hyb, Grazing 1AU/5ac","A",45,90,null,50,1,null,100,0.8,null,"ALL",null,null,null,null,null,null,null,null,null,null,null,null,"E"]
[46,"Bermudagrass, Hyb, Grazing 1AU/6 + ac","A",30,60,null,50,1,null,80,0.64,null,"ALL",null,null,null,null,null,null,null,null,null,null,null,null,"E"]
[47,"Bermudagrass, Hyb, Hay  (1 cut + grazing)","A",85,170,null,65,1.3,null,150,1,null,"N"]
[48,"Bermudagrass, Hyb, Hay  3000 lb","A",37.5,75,null,50,1,null,125,1]
[49,"Bermudagrass, Hyb, Hay  4000 lb","A",50,100,null,65,1.3,null,150,1.2]
[50,"Bermudagrass, Hyb, Hay  5000 lb","A",62.5,125,null,80,1.6,null,175,1.4]
[51,"Bermudagrass, Hyb, Hay  6000 lb","A",75,150,null,100,2,null,200,1.333,null,null,null,null,null,null,null,null,null,null,null,null,null,null,"E"]
[52,"Bermudagrass, Hyb, Hay  8000 lb ","A",100,200,null,100,2,null,200,1.33]
[53,"Bermudagrass, Hyb, Hay  9000 lb","A",112.5,225,null,100,2,null,200,1.33]
[54,"Bermudagrass, Hyb, Hay  10000 lb","A",125,250,null,115,2.2999999999999998,null,225,1.5]
[55,"Bermudagrass, Hyb, Hay  12000 lb","A",150,300,null,140,2.8,null,250,1.667,null,null,null,null,null,null,null,null,null,null,null,null,null,null,"E"]
[56,"Bermudagrass, Hyb, Hay  15000 lb","A",187.5,375,null,150,3,null,275,1.833]
[57,"Bermudagrass, Hyb, Hay  16000 lb","A",200,400,null,165,3.3,null,300,1.667]
[58,"Bermudagrass, Hyb, Hay  18000 lb","A",225,450,null,175,3.5,null,300,2]
[59,"Bermudagrass, Hyb, Hay  20000 lb ","A",250,500,null,200,4,null,350,1.944,null,null,null,null,null,null,null,null,null,null,null,null,null,null,"E"]
[60,"Bermudagrass, Hyb, Irr. Hay  24000 lb","A",300,600,null,240,4.8,null,400,2.222,null,null,null,null,null,null,null,null,null,null,null,null,null,null,"E"]
[61,"Bermudagrass, Hyb, Irr. Hay  28000 lb","A",350,700,null,275,5.5,null,450,2.5]
[62,"Bermudagrass, Hyb, Irr. Hay  30000 lb","A",375,750,null,275,5.5,null,425,2.3610000000000002,null,null,null,null,null,null,null,null,null,null,null,null,null,null,"E"]
[63,"Bermudagrass, Hyb, Irr. Hay  35000 lb","A",437.5,875,null,300,6,null,475,2.6389999999999998]
[64,"Bermudagrass, Hyb, Irr. Hay  36000 lb","A",450,900,null,300,6,null,450,2.5]
[65,"Bermudagrass, Hyb, Irr. Hay  42000 lb","A",525,1050,null,325,6.5,null,500,2.778]
[66,"Bermudagrass, NK-37 or Midland Grazing","A",80,160,null,80,1.6,null,120,0.96]
[{"$f":"A69+1","v":67},"Bermudagrass, NK-37 or Midland 7000 lb","A",100,200,null,105,2.1,null,200,1.6]
[68,"Bermudagrass, NK-37 or Midland 12000 lb","A",210,420,null,110,2.2000000000000002,null,310,1.409]
[69,"Blue Panic, grazing","A",65,130,null,55,1.1000000000000001,null,40,0.32]
[70,"Blueberry","A",30,60,null,31,0.63,null,0,0]
[71,"Bluestems, Native or KR Grazing or Hay","A",65,130,null,55,1.1000000000000001,null,120,0.96]
[72,"Bluestems, OW Improved, Grazing or Hay","A",120,240,null,65,1.3,null,120,0.92300000000000004]
[73,"Broccoli - Field Production","A",40,80,null,106,1.77,null,80,0.64]
[74,"Buffelgrass (Heavy Grazing or Hay + Graze)","A",105,210,null,65,1.3,null,120,0.96,null,"N"]
[75,"Buffelgrass (Moderate Grazing)","A",75,150,null,65,1.3,null,120,0.96,null,"N"]
[76,"Buffelgrass Hay 4000 lb","A",40,80,null,65,1.3,null,80,0.64,null,"N",null,null,null,null,null,null,null,null,null,null,null,null,"E"]
[77,"Buffelgrass Hay 6000 lb","A",80,160,null,80,1.3,null,100,0.8,null,"ALL",null,null,null,null,null,null,null,null,null,null,null,null,"E"]
[78,"Buffelgrass Hay 8000 lb","A",120,240,null,105,2.1,null,120,0.96,null,"N"]
[79,"Cabbage - Field Production","A",50,100,null,131,2.19,null,160,1.27]
[80,"Cabbage-Chinese","A",50,100,null,131,2.19,null,160,1.27]
[81,"Cane","A",30,60,null,55,1.1000000000000001,null,40,0.308,null,"ALL"]
[82,"Cantaloupe - Field Production","A",20,40,null,106,1.77,null,80,0.64]
[83,"Carrots - Field Production","A",40,80,null,106,2.13,null,120,0.95]
[84,"Cauliflower - Field Production","A",40,80,null,106,2.13,null,120,0.95]
[85,"Citrus","A",50,100,null,81,1.63,null,130,0.95]
[86,"Clover, Vetch (Prepared Seedbed)","A",5,10,null,105,2.1,null,120,0.68600000000000005]
[87,"Clover, Vetch (Sod Seeded)","A",30,60,null,105,2.1,null,120,0.68600000000000005,null,"ALL"]
[88,"Clover, Vetch + Ryegrass or Sm.Grain","A",55,110,null,105,2.1,null,120,0.68600000000000005]
[89,"Collards","A",40,80,null,106,2.13,null,120,0.95]
[90,"Corn 100 bu","A",60,120,null,80,1.6,null,110,0.75]
[91,"Corn 110 bu","A",60,120,null,105,2.1,null,110,0.75]
[92,"Corn 120 bu","A",72,144,null,105,2.1,null,130,1.03]
[93,"Corn 130 bu","A",72,144,null,105,2.1,null,130,1.03]
[94,"Corn 140 bu","A",82,164,null,105,2.1,null,130,1.03]
[95,"Corn 150 bu","A",82,164,null,105,2.1,null,130,1.03]
[96,"Corn 160 bu","A",90,180,null,130,2.6,null,140,1.1499999999999999]
[97,"Corn 170 bu","A",90,180,null,130,2.6,null,140,1.1499999999999999]
[98,"Corn 180 bu","A",105,210,null,130,2.6,null,140,1.1000000000000001]
[99,"Corn 190 bu","A",105,210,null,130,2.6,null,140,1.1000000000000001]
[100,"Corn 200 bu","A",125,250,null,130,2.6,null,140,1.05]
[101,"Corn 210 bu","A",125,250,null,150,3,null,140,1.05]
[102,"Corn 220 bu","A",140,280,null,150,3,null,150,1.1000000000000001]
[103,"Corn 230 bu","A",140,280,null,150,3,null,150,1.1000000000000001]
[104,"Corn 240 bu","A",150,300,null,150,3,null,150,1.05]
[105,"Corn 250 bu","A",150,300,null,175,3.5,null,150,1.05]
[106,"Corn 260 bu","A",160,320,null,175,3.5,null,150,1.05]
[107,"Corn 270 bu","A",160,320,null,175,3.5,null,150,1.05]
[108,"Corn 70 bu or less","A",45,90,null,80,1.6,null,80,0.64]
[109,"Corn 80 bu","A",60,120,null,80,1.6,null,80,0.64]
[110,"Corn 90 bu","A",60,120,null,80,1.6,null,110,0.75]
[111,"Cotton 0.5 bale","A",12.5,25,null,55,1.1000000000000001,null,30,0.24,null,"ALL",null,null,null,null,null,null,null,null,null,null,null,null,"E"]
[112,"Cotton 0.75 bale","A",18.75,37.5,null,55,1.1000000000000001,null,30,0.24,null,"ALL",null,null,null,null,null,null,null,null,null,null,null,null,"E"]
[113,"Cotton 1 bale","A",25,50,null,55,1.1000000000000001,null,30,0.24]
[114,"Cotton 1.25 bale","A",31.25,62.5,null,80,1.6,null,50,0.4,null,"ALL",null,null,null,null,null,null,null,null,null,null,null,null,"E"]
[115,"Cotton 1.5 bale","A",37.5,75,null,80,1.6,null,50,0.4]
[116,"Cotton 1.75 bale","A",43.75,87.5,null,105,2.1,null,120,0.95,null,"ALL",null,null,null,null,null,null,null,null,null,null,null,null,"E"]
[117,"Cotton 2 bale","A",50,100,null,105,2.1,null,120,0.95]
[118,"Cotton 2.25 bale","A",56.25,112.5,null,105,2.1,null,120,0.95,null,"ALL",null,null,null,null,null,null,null,null,null,null,null,null,"E"]
[119,"Cotton 2.5 bale","A",62.5,125,null,105,2.1,null,120,0.95]
[120,"Cotton 2.75 bale","A",68.75,137.5,null,105,2.1,null,120,0.95,null,"ALL",null,null,null,null,null,null,null,null,null,null,null,null,"E"]
[121,"Cotton 3 bale","A",75,150,null,120,2.4,null,120,0.95]
[122,"Cotton 3.5 bale","A",87.5,175,null,120,2.4,null,120,0.95]
[123,"Cotton 4.0 bale","A",100,200,null,130,2.6,null,120,0.95]
[124,"Cotton 4.5 bale","A",112.5,225,null,130,2.6,null,120,0.95]
[125,"Cotton 5.0 bale","A",125,250,null,140,2.8,null,120,0.95]
[126,"Cucumbers - Field Production","A",40,80,null,106,1.77,null,80,0.64]
[127,"Dallis Grass (1 cutting plus grazing)","A",115,230,null,65,1.3,null,120,0.96]
[128,"Dallis Grass, Grazing, 1AU/1 - 1.5 ac","A",115,230,null,65,1.3,null,120,0.96]
[129,"Dallis Grass, Grazing, 1AU/1.5 - 2 ac","A",95,190,null,65,1.3,null,120,0.96]
[130,"Desoto Grass","A",20,40,null,55,1.1000000000000001,null,120,0.96]
[131,"Eggplant - Field Production","A",60,120,null,106,1.77,null,120,0.95]
[132,"Fescue, 3-4 AU/ac or Hay","A",60,120,null,80,1.6,null,120,0.96]
[133,"Flax","A",20,40,null,56,1.1299999999999999,null,40,0.32]
[134,"Flowers","S",30,1.5,null,3,0.06,null,0,0]
[135,"Forage Sorghum","A",20,40,null,55,1.1000000000000001,null,120,0.96]
[136,"Fruit trees","S",30,1.38,null,3,0.06,null,0,0]
[137,"Garden","AS",30,1.38,null,4,0.08,null,0,0]
[138,"Garlic","A",50,100,null,131,2.63,null,100,0.79]
[139,"Golf Greens - Native and Pushup","S",30,1.5,null,100,2,null,0,0]
[140,"Golf Greens - Sand Based","S",30,1.5,null,100,2,null,0,0]
[141,"Grain Sorghum 1000 lb","A",10,20,null,30,0.6,null,10,0.16]
[142,"Grain Sorghum 1500 lb","A",15,30,null,30,0.6,null,15,0.16,null,"ALL",null,null,null,null,null,null,null,null,null,null,null,null,"E"]
[143,"Grain Sorghum 2000 lb","A",20,40,null,40,0.8,null,20,0.16]
[144,"Grain Sorghum 2500 lb","A",25,50,null,50,1,null,60,0.64,null,"ALL",null,null,null,null,null,null,null,null,null,null,null,null,"E"]
[145,"Grain Sorghum 3000 lb","A",30,60,null,55,1.1000000000000001,null,60,0.64]
[{"$f":"A148+1","v":146},"Grain Sorghum 3500 lb","A",35,70,null,60,1.2,null,70,0.64,null,"ALL",null,null,null,null,null,null,null,null,null,null,null,null,"E"]
[147,"Grain Sorghum 4000 lb","A",40,80,null,65,1.3,null,80,0.64]
[148,"Grain Sorghum 4500 lb","A",45,90,null,75,1.5,null,100,0.79,null,"ALL",null,null,null,null,null,null,null,null,null,null,null,null,"E"]
[149,"Grain Sorghum 5000 lb","A",50,100,null,80,1.6,null,100,0.79]
[150,"Grain Sorghum 5500 lb","A",55,110,null,90,1.8,null,100,0.79,null,"ALL",null,null,null,null,null,null,null,null,null,null,null,null,"E"]
[151,"Grain Sorghum 6000 lb","A",60,120,null,105,2.1,null,100,0.79]
[152,"Grain Sorghum 6500 lb","A",65,130,null,120,2.4,null,120,0.95,null,"ALL",null,null,null,null,null,null,null,null,null,null,null,null,"E"]
[153,"Grain Sorghum 7000 lb","A",70,140,null,130,2.6,null,120,0.95]
[154,"Grain Sorghum 7500 lb","A",75,150,null,135,2.7,null,120,0.95,null,"ALL",null,null,null,null,null,null,null,null,null,null,null,null,"E"]
[155,"Grain Sorghum 8000 lb","A",80,160,null,140,2.8,null,120,0.95]
[156,"Grain Sorghum 8500 lb","A",85,170,null,150,3,null,140,1.1060000000000001]
[157,"Grain Sorghum 9000 lb","A",90,180,null,160,3.2,null,140,1.1060000000000001]
[158,"Grain Sorghum 9500 lb","A",95,190,null,170,3.4,null,140,1.1060000000000001]
[159,"Grain Sorghum 10000 lb","A",100,200,null,180,3.6,null,140,1.1060000000000001]
[160,"Grapes - Field Production","A",12.5,25,null,31,0.63,null,50,0.33,null,"N",null,null,null,null,null,null,null,null,null,null,null,null,"E"]
[161,"Guar","A",10,20,null,81,1.63,null,60,0.48]
[162,"Hay Grazer (1 cutting or light grazing)","A",40,80,null,55,1.1000000000000001,null,40,0.32]
[163,"Hay Grazer (2 cuttings or moderate grazing)","A",70,140,null,55,1.1000000000000001,null,120,0.96]
[164,"Hay Grazer (3 cuttings or heavy grazing)","A",100,200,null,105,2.1,null,120,0.96]
[165,"Hegari","A",30,60,null,80,1.6,null,60,0.48]
[166,"Huban Clover","A",10,20,null,80,1.6,null,60,0.48]
[167,"Johnson Grass 1 cutting or light grazing","A",40,80,null,55,1.1000000000000001,null,40,0.32]
[168,"Johnson Grass 2 cuttings or moderate grazing","A",70,140,null,55,1.1000000000000001,null,40,0.32]
[169,"Johnson Grass 3 cuttings or heavy grazing","A",100,200,null,105,2.1,null,120,0.96]
[170,"Kenaf","A",50,100,null,65,1.3,null,120,0.95]
[171,"Kleingrass Grazing 1 AU/1.25 - 1.75 ac or Hay","A",75,150,null,80,1.6,null,120,0.96]
[172,"Kleingrass Grazing 1 AU/2 - 3 ac or Hay","A",65,110,null,55,1.1000000000000001,null,50,0.4]
[173,"Kleingrass Grazing 1 AU/4ac","A",40,80,null,55,1.1000000000000001,null,50,0.4,null,"ALL",null,null,null,null,null,null,null,null,null,null,null,null,"E"]
[174,"Kleingrass Grazing 1 AU/6+ ac","A",25,50,null,55,1.1000000000000001,null,50,0.4,null,"ALL",null,null,null,null,null,null,null,null,null,null,null,null,"E"]
[175,"Landscape","S",30,1.38,null,4,0.08,null,0,0]
[176,"Lawn - Bermuda, St. Augustine, or Zoyzia","AS",22,1.02,null,3,0.06,null,0,0]
[177,"Lawn - Fescue, Buffalograss and other","AS",22,1.02,null,3,0.06,null,0,0]
[178,"Lettuce 10 T","A",50,100,null,131,2.63,null,120,0.95,null,"ALL",null,null,null,null,null,null,null,null,null,null,null,null,"E"]
[179,"Lovegrass Grazing or Hay","A",35,70,null,55,1.1000000000000001,null,70,0.318,null,"ALL"]
[180,"Mexican Wheat","A",30,60,null,55,1.1000000000000001,null,60,0.32400000000000001]
[181,"Millet (1 hay cutting or light grazing)","A",20,40,null,55,1.1000000000000001,null,40,0.32]
[182,"Millet (2 hay cutting or moderate grazing)","A",50,100,null,65,1.3,null,40,0.4]
[183,"Mustard","A",25,50,null,106,2.13,null,120,0.95]
[184,"Oats 60 - 80 Bu","A",40,80,null,55,1.1000000000000001,null,40,0.32]
[185,"Oats 81 - 100 Bu","A",50,100,null,105,2.1,null,100,0.79]
[186,"Oats Hay only, 2 - 3 T","A",40,80,null,55,1.1000000000000001,null,40,0.32]
[187,"Oats Heavy Grazing plus hay or grain","A",110,220,null,80,1.6,null,120,0.96]
[188,"Oats Light Grazing","A",60,120,null,55,1.1000000000000001,null,60,0.48]
[189,"Oats Moderate Grazing","A",80,160,null,80,1.6,null,120,0.96]
[190,"Oats (Sod Seeded) Grazing","A",70,140,null,80,1.6,null,100,0.8]
[191,"Okra","A",20,40,null,81,1.63,null,80,0.64]
[192,"Onions ","A",50,100,null,131,2.63,null,100,0.79]
[193,"Peaches - Production","A",20,40,null,50,1,null,150,0.95]
[194,"Peanuts, Dryland, 1000 - 3500 lb","A",10,20,null,69,1.38,null,61,0.28999999999999998]
[195,"Peanuts, Irrigated, 4000 - 5000 lb","A",10,20,null,94,1.88,null,82,0.39]
[196,"Peas, Blackeye","A",10,20,null,56,1.1299999999999999,null,40,0.32]
[197,"Peas, Green","A",30,60,null,56,1.1299999999999999,null,40,0.32]
[198,"Pecans, individual trees","S",60,3,null,4,0.08,null,0,0]
[199,"Pecans, Upland Groves","A",74,148,null,81,1.63,null,100,1]
[200,"Peppers, Bell","A",60,120,null,106,2.13,null,120,0.95]
[201,"Peppers, Chile","A",30,60,null,106,2.13,null,120,0.95]
[202,"Potatoes  (early variety)","A",80,160,null,250,4.17,null,100,0.79]
[203,"Potatoes  (late variety)","A",100,200,null,250,4.17,null,100,0.79]
[204,"Radishes","A",30,60,null,106,2.13,null,120,0.95]
[205,"Range Grass Mix, <1000 lb Grazing","A",5,10,null,20,0.4,null,30,0.24,null,null,null,null,null,null,null,null,null,null,null,null,null,null,"E"]
[206,"Range Grass Mix, 1000-2000 lbGrazing","A",10,20,null,40,0.8,null,60,0.48,null,null,null,null,null,null,null,null,null,null,null,null,null,null,"E"]
[207,"Range Grass Mix, >2000 Lb Grazing","A",20,40,null,55,1.1000000000000001,null,120,0.96]
[208,"Red Top Cane, Grain","A",30,60,null,80,1.6,null,120,0.96]
[209,"Rhodes Grass","A",20,40,null,65,1.3,null,120,0.96]
[{"$f":"A212+1","v":210},"Rice, Early (Rice Guide)","A",92.5,185,null,45,1.8,null,40,0.8,null,null,null,null,null,null,null,null,null,null,null,null,null,null,"E"]
[211,"Rice, Late(Rice Guide)","A",85,170,null,45,1.8,null,40,0.8,null,null,null,null,null,null,null,null,null,null,null,null,null,null,"E"]
[212,"Rice, Early w/Ratoon(Rice Guide)","A",147.5,295,null,60,1.8,null,40,0.8,null,null,null,null,null,null,null,null,null,null,null,null,null,null,"E"]
[213,"Rice, Late w/Ratoon(Rice Guide)","A",142.5,285,null,60,1.8,null,40,0.8,null,null,null,null,null,null,null,null,null,null,null,null,null,null,"E"]
[214,"Rice Fallow (Not Grazed)","A",0,0,0,0,0,0,0,0,0,null,null,null,null,null,null,null,null,null,null,null,null,null,"E"]
[215,"Rice (Eastern Belt - Clay soils)","A",87.5,175,null,45,1.8,null,40,0.8]
[216,"Rice (Eastern Belt - Sandy soils)","A",75,150,null,45,1.8,null,40,0.8]
[217,"Rice (Western Belt - Clay soils)","A",87.5,175,null,45,1.8,null,40,0.8]
[218,"Rice (Western Belt - Sandy soils)","A",75,150,null,45,1.8,null,40,0.8]
[219,"Rice-Flooded (Eastern Belt - Clay soils)","A",90,180,null,45,1.8,null,40,0.8]
[220,"Rice-Flooded (Eastern Belt - Sandy soils)","A",90,180,null,45,1.8,null,40,0.8]
[221,"Rice-Flooded (Western Belt - Clay soils)","A",90,180,null,45,1.8,null,40,0.8]
[222,"Rice-Flooded (Western Belt - Sandy soils)","A",90,180,null,45,1.8,null,40,0.8]
[223,"Roses","S",35,1.75,null,4,0.08,null,0,0]
[224,"Rye, Grain","A",35,70,null,55,1.1000000000000001,null,120,0.95]
[225,"Rye, Heavy Grazing","A",140,280,null,80,1.6,null,120,0.96]
[226,"Rye, Moderate Grazing","A",70,140,null,55,1.1000000000000001,null,120,0.96]
[227,"Ryegrass, Heavy Grazing","A",100,200,null,80,1.6,null,120,0.96]
[228,"Ryegrass, Moderate Grazing","A",65,130,null,55,1.1000000000000001,null,120,0.96]
[229,"Ryegrass, Sod Seeded, Light Grazing","A",40,80,null,105,2.1,null,120,0.96]
[230,"Sesame","A",25,50,null,81,1.63,null,50,0.4]
[231,"Shade Trees","AS",30,1.39,null,3,0.06,null,0,0]
[232,"Shrubs and Ornamentals","S",30,1.39,null,3,0.06,null,0,0]
[233,"Silage - Corn, 11 - 15 T","A",75,150,null,105,2.1,null,100,0.8]
[234,"Silage - Corn, 16 - 20 T","A",100,200,null,105,2.1,null,120,0.96]
[235,"Silage - Corn, 21 - 25 T","A",125,250,null,105,2.1,null,120,0.96]
[236,"Silage - Corn, 26 - 30 T","A",150,300,null,155,3.1,null,160,1.28]
[237,"Silage - Corn, 7 - 10 T","A",50,100,null,80,1.6,null,55,0.44]
[238,"Silage - Sorghum, 11 - 15 T","A",65,130,null,105,2.1,null,100,0.8]
[239,"Silage - Sorghum, 16 - 20 T","A",90,180,null,105,2.1,null,120,0.96]
[240,"Silage - Sorghum, 21 - 25 T","A",110,220,null,105,2.1,null,120,0.96]
[241,"Silage - Sorghum, 26 - 30 T","A",130,260,null,130,2.6,null,160,1.28]
[242,"Silage - Sorghum, 7-10 T","A",35,70,null,80,1.6,null,55,0.44]
[243,"Sm. Grain or Ryegrass, Intensive Grazing","A",120,240,null,80,1.6,null,120,0.96]
[244,"Small Grain or Ryegrass, Moderate Grazing","A",90,180,null,80,1.6,null,120,0.96]
[245,"Sm.Grain or Ryegrass, Sod Seeded, Lt.Grazing","A",30,60,null,105,2.1,null,120,0.96]
[246,"Sodgrass Production","A",40,80,null,106,2.13,null,160,1.27]
[247,"Sorghum Alum","A",20,40,null,55,1.1000000000000001,null,120,0.96]
[248,"Soybean ","A",5,10,null,80,1.6,null,125,0.71]
[249,"Spinach ","A",20,40,null,106,2.13,null,120,0.95]
[250,"Squash, Summer or Winter","A",20,40,null,106,2.13,null,80,0.64]
[251,"Strawberries","A",20,40,null,106,2.13,null,120,0.95]
[252,"Sudan - Sorg. Hybrid (1 cut or light graze)","A",40,80,null,55,1.1000000000000001,null,120,0.96]
[253,"Sudan - Sorg. Hybrid (2 cut or moderate graze)","A",70,140,null,55,1.1000000000000001,null,120,0.96]
[254,"Sudan - Sorg. Hybrid (3 cut or heavy graze)","A",100,200,null,105,2.1,null,120,0.96]
[255,"Sudan Grass (1 cutting or light grazing","A",40,80,null,55,1.1000000000000001,null,120,0.96]
[256,"Sudan Grass (2 cuttings or moderate grazing)","A",70,140,null,55,1.1000000000000001,null,120,0.96]
[257,"Sudan Grass (3 cuttings or heavy grazing)","A",100,200,null,105,2.1,null,120,0.96]
[258,"Sugarcane","A",85,170,null,106,2.13,null,150,0.95,null,"ALL"]
[259,"Sunflowers","A",15,30,null,56,1.1299999999999999,null,30,0.24]
[260,"Sweet Corn ","A",60,120,null,106,2.13,null,80,0.64]
[261,"Sweet Potatoes","A",15,30,null,156,3.13,null,200,1.1399999999999999]
[262,"Swiss Chard","A",60,120,null,81,1.63,null,90,0.71]
[263,"Switchgrass Grazing","A",20,40,null,55,1.1000000000000001,null,120,0.96]
[264,"Tomatoes ","A",30,60,null,131,2.63,null,160,1.27]
[265,"Triticale, Grain","A",35,70,null,56,1.1299999999999999,null,40,0.32,null,"ALL",null,null,null,null,null,null,null,null,null,null,null,null,"E"]
[266,"Triticale, Grazing","A",60,120,null,80,1.6,null,120,0.96,null,"ALL"]
[267,"Turf Fairways - Low, Mod. or High Maint.","A",30,60,null,56,1.1299999999999999,null,150,0.95]
[268,"Turnips - grazing","A",70,140,null,105,2.1,null,120,0.96]
[269,"Turnips - production","A",30,60,null,106,2.13,null,120,0.95]
[270,"Vegetables, Truck Farming","A",90,180,null,131,2.63,null,160,1.27]
[271,"Vetch + Ryegrass or Sm. Grain","A",70,140,null,105,2.1,null,120,0.68600000000000005]
[272,"Watermelons ","A",40,80,null,56,1.1299999999999999,null,60,0.48]
[273,"Wheat (heavy grazing)","A",120,240,null,105,2.1,null,120,0.96]
[{"$f":"A276+1","v":274},"Wheat (light grazing)","A",80,160,null,80,1.6,null,120,0.96]
[275,"Wheat (moderate grazing)","A",100,200,null,105,2.1,null,120,0.96]
[276,"Wheat 100 bu grain only","A",75,150,null,90,1.8,null,120,0.95,null,"n",null,null,null,null,null,null,null,null,null,null,null,null,"E"]
[277,"Wheat 20 - 29 bu grain + grazing","A",45,90,null,30,0.6,null,120,0.96]
[278,"Wheat 20 bu grain only","A",22,44,null,30,0.6,null,120,0.95,null,"n",null,null,null,null,null,null,null,null,null,null,null,null,"E"]
[279,"Wheat 30 - 39 bu grain + grazing","A",65,130,null,55,1.1000000000000001,null,120,0.96]
[280,"Wheat 30 bu grain only","A",30,60,null,55,1.1000000000000001,null,120,0.95,null,"n",null,null,null,null,null,null,null,null,null,null,null,null,"E"]
[281,"Wheat 40 - 59 bu grain + grazing","A",90,180,null,75,1.5,null,120,0.96]
[282,"Wheat 40 bu grain only","A",38,76,null,75,1.5,null,120,0.95,null,"n",null,null,null,null,null,null,null,null,null,null,null,null,"E"]
[283,"Wheat 60 - 79 bu grain + grazing","A",115,230,null,85,1.7,null,120,0.96]
[284,"Wheat 50 bu grain only","A",45,90,null,75,1.5,null,120,0.95,null,"n",null,null,null,null,null,null,null,null,null,null,null,null,"E"]
[285,"Wheat 80 - 100 bu grain + grazing","A",140,280,null,90,1.8,null,120,0.96]
[286,"Wheat 60 bu grain only","A",52,105,null,85,1.7,null,120,0.95,null,"n",null,null,null,null,null,null,null,null,null,null,null,null,"E"]
[287,"Wheat 70 bu grain only","A",60,120,null,85,1.7,null,120,0.95,null,"n",null,null,null,null,null,null,null,null,null,null,null,null,"E"]
[288,"Wheat 80 bu grain only","A",68,136,null,90,1.8,null,120,0.95,null,"n",null,null,null,null,null,null,null,null,null,null,null,null,"E"]
[289,"Wheat 90 bu grain only","A",75,150,null,90,1.8,null,120,0.95,null,"n",null,null,null,null,null,null,null,null,null,null,null,null,"E"]
[290,"Wheat Grass-Jose, Heavy Grazing","A",150,300,null,130,2.6,null,120,0.96]
[291,"Wheat Grass-Jose, Light Grazing","A",75,150,null,80,1.6,null,120,0.96]
[292,"Wheat Greenchop 2 Ton @ 75% moisture","A",20,40,null,55,1.1000000000000001,null,120,0.96]
[293,"Wheat Greenchop 3 Ton @ 75% moisture","A",27.5,55,null,55,1.1000000000000001,null,120,0.96]
[294,"Wheat Greenchop 4 Ton @ 75% moisture","A",37.5,75,null,65,1.3,null,150,1]
[295,"Wheat Greenchop 5 Ton @ 75% moisture","A",47.5,95,null,65,1.3,null,150,1]
[296,"Wheat Greenchop 6 Ton @ 75% moisture","A",55,110,null,80,1.6,null,175,1.0940000000000001]
[297,"Wheat Greenchop 7 Ton @ 75% moisture","A",65,130,null,80,1.6,null,175,1.0940000000000001]
[298,"Wheat Greenchop 8 Ton @ 75% moisture","A",75,150,null,80,1.6,null,175,1.0940000000000001]
[299," Wheat Hay (1 Ton/ac)  ","A",22.5,45,null,55,1.1000000000000001,null,120,0.96]
[300," Wheat Hay (1.5 Ton/ac)  ","A",32.5,65,null,55,1.1000000000000001,null,120,0.96]
[301," Wheat Hay (2 Ton/ac)  ","A",45,90,null,65,1.3,null,120,0.96]
[302," Wheat Hay (2.5 Ton/ac)  ","A",55,110,null,65,1.3,null,150,1]
[303," Wheat Hay (3 Ton/ac)  ","A",67.5,135,null,80,1.6,null,150,1]
[304," Wheat Hay (3.5 Ton/ac)  ","A",77.5,155,null,80,1.6,null,175,1.0940000000000001]
[305," Wheat Hay (4 Ton/ac)  ","A",90,180,null,80,1.6,null,175,1.0940000000000001]
[306,"Wheat Silage 3 Ton @ 65% moisture","A",35,70,null,55,1.1000000000000001,null,120,0.96]
[307,"Wheat Silage 4.5 Ton @ 65% moisture","A",50,100,null,65,1.3,null,120,0.96]
[308,"Wheat Silage 6 Ton @ 65% moisture","A",70,140,null,65,1.3,null,150,1]
[309,"Wheat Silage 7.5 Ton @ 65% moisture","A",85,170,null,80,1.6,null,150,1]
[310,"Wheat Silage 9 Ton @ 65% moisture","A",105,210,null,80,1.6,null,175,1.0940000000000001]
[null,"Establishment"]
[null,"Alfalfa - Irr. Est.","A",10,20,null,130,2.1669999999999998,null,160,1.28]
[null,"Alfalfa - Non-Irr. Est.","A",10,20,null,80,1.333,null,120,0.96]
[null,"Bahiagrass - Est.","A",20,40,null,105,2.1,null,120,0.96,null,null,40,40]
[null,"Bermudagrass, Common - Est.","A",20,40,null,105,2.1,null,100,0.8]
[null,"Bermudagrass, Improved - Irr. Est.","A",20,40,null,105,2.1,null,100,0.8,null,null,40,40]
[null,"Bermudagrass, Improved - non-irr. Est","A",20,40,null,105,2.1,null,100,0.8,null,null,40,40]
[null,"Bermudagrass, NK-37 or Midland - Est","A",20,40,null,55,1.1000000000000001,null,40,0.88900000000000001]
[null,"Blue Panic - Est.","A",20,40,null,55,1.1000000000000001,null,40,0.32]
[null,"Bluestems - Est","A",20,40,null,55,1.1000000000000001,null,40,0.32]
[null,"Buffelgrass - Est","A",20,40,null,105,2.1,null,120,0.96,null,"n",40,40]
[null,"Dallisgrass - Est","A",20,40,null,105,2.1,null,120,0.96,null,null,40,40]
[null,"Fescue Est.","A",20,40,null,80,1.6,null,60,0.48]
[null,"Kleingrass - Est.","A",20,40,null,55,1.1000000000000001,null,60,0.48]
[null,"Lawn - Est.","AS",12,0.57999999999999996,null,4,0.08,null,0,0]
[null,"Lovegrass - Est.","A",20,40,null,55,1.1000000000000001,null,40,0.32,null,"all"]
[null,"Peach - Est.","A",20,40,null,75,1.5,null,150,0.95]
[null,"Range Grass Mix - Est","A",20,40,null,55,1.1000000000000001,null,40,0.32]
[null,"Rhodesgrass - Est.","A",20,40,null,105,2.1,null,120,0.96,null,null,40,40]
[null,"Switchgrass - Est.","A",20,40,null,55,1.1000000000000001,null,120,0.96]
[]
[null,"SOIL NITRATE - N (ppm)",{"$f":"IF(TAMU!B3<>\"\",TAMU!B3,0)","v":2}]
[null,"SOIL TEST PHOSPHORUS (ppm)",{"$f":"IF(TAMU!C3<>\"\",TAMU!C3,0)","v":5}]
[null,"SOIL TEST POTASSIUM (ppm)",{"$f":"IF(TAMU!D3<>\"\",TAMU!D3,0)","v":80}]
["( 1 )","( 2 )","( 4 )","( 5 )","( 6 )","(7)","(8)","(18)","( 19 )","( 20 )","( 21 )","( 22 )"]
[null,"Crop","Units","NO3-N ppm","Max        N         lbs","Recom lbs / unit","P rate","P Factor","Recom lbs / unit","K           ppm","Max      K2O       lbs","Recom lbs / unit"]
[null,"and","A = Ac"]
[null,"Yield","S = SF"]
[null,"Lawn and Garden"]
[1,{"$f":"B8","v":"Aloe Vera"},"A",25,50,{"$f":"IF(OR($C$335=\"\",D343=\"\",E343=\"\"),\"\",IF(OR(D343=0,E343=0),0,IF(C343=\"S\",((E343-(E343/D343*$C$335))*43.56),E343-(E343/D343*$C$335))))","v":46},{"$f":"G8","v":3},{"$f":"H8","v":0.06},{"$f":"G343-($C$336*H343)","v":2.7},{"$f":"J8","v":40},{"$f":"K8","v":0.32},{"$f":"J343-($C$337*K343)","v":14.399999999999999}]
[2,"Apples","AS",20,1,{"$f":"IF(OR($C$335=\"\",D344=\"\",E344=\"\"),\"\",IF(OR(D344=0,E344=0),0,IF(C344=\"AS\",((E344-(E344/D344*$C$335))*43.56),E344-(E344/D344*$C$335))))","v":39.204000000000001},{"$f":"G9","v":38},{"$f":"H9","v":0.75},34.25,{"$f":"J9","v":150},{"$f":"K9","v":0.95},{"$f":"J344-($C$337*K344)","v":74}]
[3,{"$f":"B11","v":"Azaleas and Camelias"},{"$f":"C11","v":"AS"},{"$f":"D11","v":30},{"$f":"E11","v":1.4},{"$f":"IF(OR($C$335=\"\",D345=\"\",E345=\"\"),\"\",IF(OR(D345=0,E345=0),0,IF(C345=\"AS\",((E345-(E345/D345*$C$335))*43.56),E345-(E345/D345*$C$335))))","v":56.918400000000005},{"$f":"G11","v":3},{"$f":"H11","v":0.06},2.7,{"$f":"J11","v":0},{"$f":"K11","v":0},0]
[4,{"$f":"B137","v":"Flowers"},{"$f":"C137","v":"S"},{"$f":"D137","v":30},{"$f":"E137","v":1.5},{"$f":"IF(OR($C$335=\"\",D346=\"\",E346=\"\"),\"\",IF(OR(D346=0,E346=0),0,IF(C346=\"S\",((E346-(E346/D346*$C$335))*43.56),E346-(E346/D346*$C$335))))","v":60.984000000000002},{"$f":"G137","v":3},{"$f":"H137","v":0.06},2.7,{"$f":"J137","v":0},{"$f":"K137","v":0},0]
[5,{"$f":"B139","v":"Fruit trees"},"S",30,1.38,{"$f":"IF(OR($C$335=\"\",D347=\"\",E347=\"\"),\"\",IF(OR(D347=0,E347=0),0,IF(C347=\"S\",((E347-(E347/D347*$C$335))*43.56),E347-(E347/D347*$C$335))))","v":56.105279999999993},{"$f":"G139","v":3},{"$f":"H139","v":0.06},2.7,{"$f":"J139","v":0},{"$f":"K139","v":0},0]
[6,"Garden","AS",30,1.38,{"$f":"IF(OR($C$335=\"\",D348=\"\",E348=\"\"),\"\",IF(OR(D348=0,E348=0),0,IF(C348=\"AS\",((E348-(E348/D348*$C$335))*43.56),E348-(E348/D348*$C$335))))","v":56.105279999999993},{"$f":"G140","v":4},{"$f":"H140","v":0.08},3.6,{"$f":"J140","v":0},{"$f":"K140","v":0},0]
[7,{"$f":"B178","v":"Landscape"},"S",30,1.38,{"$f":"IF(OR($C$335=\"\",D349=\"\",E349=\"\"),\"\",IF(OR(D349=0,E349=0),0,IF(C349=\"S\",((E349-(E349/D349*$C$335))*43.56),E349-(E349/D349*$C$335))))","v":56.105279999999993},{"$f":"G178","v":4},0.08,3.6,{"$f":"J178","v":0},0,0]
[8,"Lawn - Bermuda, St. Augustine, or Zoyzia","AS",22,1.02,{"$f":"IF(OR($C$335=\"\",D350=\"\",E350=\"\"),\"\",IF(OR(D350=0,E350=0),0,IF(C350=\"AS\",((E350-(E350/D350*$C$335))*43.56),E350-(E350/D350*$C$335))))","v":40.392000000000003},3,0.06,2.7,0,0,0]
[9,"Lawn - Fescue, Buffalograss and other","AS",22,1.02,{"$f":"IF(OR($C$335=\"\",D351=\"\",E351=\"\"),\"\",IF(OR(D351=0,E351=0),0,IF(C351=\"AS\",((E351-(E351/D351*$C$335))*43.56),E351-(E351/D351*$C$335))))","v":40.392000000000003},3,0.06,2.7,0,0,0]
[10,{"$f":"B201","v":"Pecans, individual trees"},{"$f":"C201","v":"S"},{"$f":"D201","v":60},{"$f":"E201","v":3},{"$f":"IF(OR($C$335=\"\",D352=\"\",E352=\"\"),\"\",IF(OR(D352=0,E352=0),0,IF(C352=\"S\",((E352-(E352/D352*$C$335))*43.56),E352-(E352/D352*$C$335))))","v":126.324},{"$f":"G201","v":4},{"$f":"H201","v":0.08},3.6,{"$f":"J201","v":0},{"$f":"K201","v":0},0]
[11,{"$f":"B226","v":"Roses"},{"$f":"C226","v":"S"},{"$f":"D226","v":35},{"$f":"E226","v":1.75},{"$f":"IF(OR($C$335=\"\",D353=\"\",E353=\"\"),\"\",IF(OR(D353=0,E353=0),0,IF(C353=\"S\",((E353-(E353/D353*$C$335))*43.56),E353-(E353/D353*$C$335))))","v":71.873999999999995},{"$f":"G226","v":4},{"$f":"H226","v":0.08},3.6,{"$f":"J226","v":0},{"$f":"K226","v":0},0]
[12,{"$f":"B234","v":"Shade Trees"},"AS",30,1.39,{"$f":"IF(OR($C$335=\"\",D354=\"\",E354=\"\"),\"\",IF(OR(D354=0,E354=0),0,IF(C354=\"AS\",((E354-(E354/D354*$C$335))*43.56),E354-(E354/D354*$C$335))))","v":56.511839999999999},{"$f":"G234","v":3},{"$f":"H234","v":0.06},2.7,{"$f":"J234","v":0},{"$f":"K234","v":0},0]
[13,"Shrubs and Ornamentals","S",30,1.39,{"$f":"IF(OR($C$335=\"\",D355=\"\",E355=\"\"),\"\",IF(OR(D355=0,E355=0),0,IF(C355=\"S\",((E355-(E355/D355*$C$335))*43.56),E355-(E355/D355*$C$335))))","v":56.511839999999999},{"$f":"G235","v":3},{"$f":"H235","v":0.06},2.7,{"$f":"J235","v":0},{"$f":"K235","v":0},0]
[null,"Forage"]
[1,{"$f":"B4","v":" AFRICAN MILLET  "},"A",30,60,{"$f":"IF(OR($C$335=\"\",D357=\"\",E357=\"\"),\"\",IF(OR(D357=0,E357=0),0,IF(C357=\"S\",((E357-(E357/D357*$C$335))*43.56),E357-(E357/D357*$C$335))))","v":56},{"$f":"G4","v":55},1.1000000000000001,{"$f":"G357-($C$336*H357)","v":49.5},{"$f":"J4","v":40},0.32,{"$f":"J357-($C$337*K357)","v":14.399999999999999}]
[{"$f":"A357+1","v":2}," ALFALFA (NON-IRRIGATED) 4 Ton","A",10,20,16,80,1.333,73.334999999999994,120,0.96,43.2]
[{"$f":"A358+1","v":3},{"$f":"B6","v":" ALFALFA (IRRIGATED) 6 TON"},"A",{"$f":"D6","v":10},{"$f":"E6","v":20},16,130,2.1669999999999998,119.16500000000001,160,1.28,57.599999999999994]
[4,{"$f":"B7","v":" ALFALFA (IRRIGATED) 8-12 TON"},{"$f":"C7","v":"A"},{"$f":"D7","v":10},{"$f":"E7","v":20},16,180,3,165,200,1.6,72]
[5,{"$f":"B12","v":"Bahiagrass Grazing 1AU/1.5ac"},"A",110,240,235.63636363636363,{"$f":"G12","v":65},1.3,58.5,{"$f":"J12","v":120},0.96,43.2]
[6,"Bahiagrass Grazing 1AU/2ac","A",80,160,156,40,0.8,36,120,0.96,43.2]
[7,"Bahiagrass Grazing 1AU/3ac","A",75,150,146,40,0.8,36,100,0.8,36]
[8,"Bahiagrass Grazing 1AU/4ac","A",70,140,136,40,0.8,36,100,0.8,36]
[9,"Bahiagrass Grazing 1AU/5ac","A",50,100,96,30,0.6,27,100,0.8,36]
[10,"Bahiagrass Grazing 1AU/6 + ac","A",30,60,56,30,0.6,27,80,0.64,28.799999999999997]
[11,"Bahiagrass Hay  (1 cutting + grazing)","A",65,130,126,65,1.3,58.5,120,0.96,43.2]
[12,"Bahiagrass Hay  6000 lb","A",70,140,136,40,0.8,36,90,0.72,32.400000000000006]
[13,"Bahiagrass Hay  8000 lb","A",105,210,206,80,1.6,72,180,1.44,64.800000000000011]
[14,"Bahiagrass Hay  10000 lb","A",210,420,416,110,2.2000000000000002,99,250,1.667,116.63999999999999]
[15,{"$f":"B24","v":"Barley 70 - 90 bu + Light grazing"},{"$f":"C24","v":"A"},{"$f":"D24","v":50},{"$f":"E24","v":100},96,{"$f":"G24","v":80},{"$f":"H22","v":1.1000000000000001},74.5,{"$f":"J24","v":90},{"$f":"K22","v":0.32},64.400000000000006]
[16,{"$f":"B25","v":"Barley heavy grazing "},"A",80,160,156,{"$f":"G25","v":105},{"$f":"H23","v":1.6},97,{"$f":"J25","v":120},{"$f":"K23","v":0.71},63.2]
[17,"Barley heavy grazing, sandy soils","A",110,220,216,{"$f":"G26","v":105},{"$f":"H24","v":1.6},97,{"$f":"J26","v":120},{"$f":"K24","v":0.72},62.400000000000006]
[18,{"$f":"B72","v":"Blue Panic, grazing"},{"$f":"C72","v":"A"},{"$f":"D72","v":65},{"$f":"E72","v":130},126,{"$f":"G72","v":55},{"$f":"H72","v":1.1000000000000001},{"$f":"G374-($C$336*H374)","v":49.5},{"$f":"J72","v":40},{"$f":"K72","v":0.32},{"$f":"J374-($C$337*K374)","v":14.399999999999999}]
[19,{"$f":"B74","v":"Bluestems, Native or KR Grazing or Hay"},"A",65,130,126,{"$f":"G74","v":55},{"$f":"H74","v":1.1000000000000001},49.5,{"$f":"J74","v":120},{"$f":"K74","v":0.96},43.2]
[20,"Bluestems, OW Improved, Grazing or Hay","A",120,240,236,{"$f":"G75","v":65},{"$f":"H75","v":1.3},58.5,{"$f":"J75","v":120},{"$f":"K75","v":0.92300000000000004},46.16]
[21,{"$f":"B77","v":"Buffelgrass (Heavy Grazing or Hay + Graze)"},"A",105,210,206,{"$f":"G77","v":65},1.3,58.5,{"$f":"J77","v":120},0.96,43.2]
[22,"Buffelgrass (Moderate Grazing)","A",75,150,146,65,1.3,58.5,120,0.96,43.2]
[23,"Buffelgrass Hay 4000 lb","A",40,80,76,65,1.3,58.5,80,0.64,28.799999999999997]
[24,"Buffelgrass Hay 6000 lb","A",80,160,156,80,1.3,73.5,100,0.8,36]
[25,"Buffelgrass Hay 8000 lb","A",120,240,236,105,2.1,94.5,120,0.96,43.2]
[26,{"$f":"B31","v":"Bermudagrass, Common, Grazing  1 AU/1.5 ac"},{"$f":"C31","v":"A"},{"$f":"D31","v":120},{"$f":"E31","v":240},236,{"$f":"G31","v":65},{"$f":"H31","v":1.3},58.5,{"$f":"J31","v":80},{"$f":"K31","v":0.64},28.799999999999997]
[27,{"$f":"B32","v":"Bermudagrass, Common, Grazing  1 AU/2 ac"},"A",90,180,176,{"$f":"G32","v":40},0.8,{"$f":"G383-($C$336*H383)","v":36},{"$f":"J32","v":50},0.33300000000000002,{"$f":"J383-($C$337*K383)","v":23.36}]
[28,"Bermudagrass, Common, Grazing 1AU/3 ac","A",90,180,176,40,0.8,36,50,0.33300000000000002,23.36]
[29,"Bermudagrass, Common, Grazing 1AU/4ac","A",80,160,156,40,0.8,36,50,0.33300000000000002,23.36]
[30,"Bermudagrass, Common, Grazing 1AU/5ac","A",70,140,{"$f":"IF(OR($C$335=\"\",D386=\"\",E386=\"\"),\"\",IF(OR(D386=0,E386=0),0,IF(C386=\"S\",((E386-(E386/D386*$C$335))*43.56),E386-(E386/D386*$C$335))))","v":136},30,0.6,27,50,0.33300000000000002,23.36]
[31,"Bermudagrass, Common, Grazing 1AU/6ac","A",50,100,96,30,0.6,27,50,0.33300000000000002,23.36]
[32,"Bermudagrass, Common, Grazing 1AU/9+ac","A",40,60,57,30,0.6,27,50,0.33300000000000002,23.36]
[33,"Bermudagrass, Common, Hay (1 cut + grazing)","A",65,130,126,65,1.3,58.5,90,0.72,32.400000000000006]
[34,"Bermudagrass, Common, Hay  5000 lb","A",70,140,136,40,0.8,36,100,0.8,36]
[35,"Bermudagrass, Common, Hay  6000 lb","A",105,210,206,65,1.3,58.5,170,1.0669999999999999,84.64]
[36,"Bermudagrass, Common, Hay  8000 lb","A",140,280,276,80,1.6,72,240,1.0669999999999999,154.63999999999999]
[37,"Bermudagrass, Common, Hay  9500 lb","A",210,420,416,80,1.6,72,310,1.409,197.28]
[38,{"$f":"B43","v":"Bermudagrass, Hyb, Grazing 1 AU/.5ac"},"A",150,300,296,65,1.6,57,120,0.96,43.2]
[39,"Bermudagrass, Hyb, Grazing 1 AU/1ac","A",135,270,266,65,1.6,57,120,0.96,43.2]
[40,{"$f":"B45","v":"Bermudagrass, Hyb, Grazing 1AU/2ac"},"A",100,200,196,{"$f":"G45","v":65},1.6,57,{"$f":"J45","v":120},0.96,43.2]
[41,"Bermudagrass, Hyb, Grazing 1AU/3ac","A",80,160,156,65,1.3,58.5,120,0.96,43.2]
[42,"Bermudagrass, Hyb, Grazing 1AU/4ac","A",60,120,116,65,1.3,58.5,100,0.8,36]
[43,"Bermudagrass, Hyb, Grazing 1AU/5ac","A",45,90,86,50,1,45,100,0.8,36]
[44,"Bermudagrass, Hyb, Grazing 1AU/6 + ac","A",30,60,56,50,1,45,80,0.64,28.799999999999997]
[45,"Bermudagrass, Hyb, Hay  (1 cut + grazing)","A",85,170,166,65,1.3,58.5,150,1,70]
[46,"Bermudagrass, Hyb, Hay  3000 lb","A",37.5,75,71,50,1,45,125,1,45]
[47,"Bermudagrass, Hyb, Hay  4000 lb","A",50,100,96,65,1.3,58.5,150,1.2,54]
[48,"Bermudagrass, Hyb, Hay  5000 lb","A",62.5,125,121,80,1.6,72,175,1.4,63]
[49,"Bermudagrass, Hyb, Hay  6000 lb","A",75,150,146,100,2,90,200,1.333,93.36]
[50,{"$f":"B55","v":"Bermudagrass, Hyb, Hay  8000 lb "},"A",100,200,{"$f":"IF(OR($C$335=\"\",D406=\"\",E406=\"\"),\"\",IF(OR(D406=0,E406=0),0,IF(C406=\"S\",((E406-(E406/D406*$C$335))*43.56),E406-(E406/D406*$C$335))))","v":196},{"$f":"G55","v":100},{"$f":"H55","v":2},90,{"$f":"J55","v":200},1.33,93.6]
[51,"Bermudagrass, Hyb, Hay  9000 lb","A",112.5,225,221,{"$f":"G56","v":100},{"$f":"H56","v":2},90,{"$f":"J56","v":200},1.33,93.6]
[52,"Bermudagrass, Hyb, Hay  10000 lb","A",125,250,246,{"$f":"G57","v":115},2.2999999999999998,103.5,225,1.5,105]
[53,"Bermudagrass, Hyb, Hay  12000 lb","A",150,300,296,140,2.8,126,250,1.667,116.63999999999999]
[54,"Bermudagrass, Hyb, Hay  15000 lb","A",187.5,375,371,150,3,135,275,1.833,128.36000000000001]
[55,"Bermudagrass, Hyb, Hay  16000 lb","A",200,400,396,165,3.3,148.5,300,1.667,166.64]
[56,"Bermudagrass, Hyb, Hay  18000 lb","A",225,450,446,175,3.5,157.5,300,2,140]
[57,"Bermudagrass, Hyb, Hay  20000 lb ","A",250,500,496,200,4,180,350,1.944,194.48000000000002]
[58,"Bermudagrass, Hyb, Irr. Hay  24000 lb","A",300,600,596,240,4.8,216,400,2.222,222.24]
[59,"Bermudagrass, Hyb, Irr. Hay  28000 lb","A",350,700,696,275,5.5,247.5,450,2.5,250]
[60,"Bermudagrass, Hyb, Irr. Hay  30000 lb","A",375,750,746,275,5.5,247.5,425,2.3610000000000002,236.11999999999998]
[61,"Bermudagrass, Hyb, Irr. Hay  35000 lb","A",437.5,875,871,300,6,270,475,2.6389999999999998,263.88]
[62,"Bermudagrass, Hyb, Irr. Hay  36000 lb","A",450,900,896,300,6,270,450,2.5,250]
[63,"Bermudagrass, Hyb, Irr. Hay  42000 lb","A",525,1050,1046,325,6.5,292.5,500,2.778,277.76]
[64,{"$f":"B69","v":"Bermudagrass, NK-37 or Midland Grazing"},"A",80,160,156,80,1.6,72,120,0.96,43.2]
[65,"Bermudagrass, NK-37 or Midland 7000 lb","A",100,200,196,105,2.1,94.5,200,1.6,72]
[66,{"$f":"B71","v":"Bermudagrass, NK-37 or Midland 12000 lb"},{"$f":"C71","v":"A"},{"$f":"D71","v":210},{"$f":"E71","v":420},{"$f":"IF(OR($C$335=\"\",D422=\"\",E422=\"\"),\"\",IF(OR(D422=0,E422=0),0,IF(C422=\"S\",((E422-(E422/D422*$C$335))*43.56),E422-(E422/D422*$C$335))))","v":416},110,2.2000000000000002,99,310,1.409,197.28]
[67,{"$f":"B84","v":"Cane"},{"$f":"C84","v":"A"},{"$f":"D84","v":30},{"$f":"E84","v":60},56,{"$f":"G84","v":55},{"$f":"H84","v":1.1000000000000001},49.5,{"$f":"J84","v":40},{"$f":"K84","v":0.308},15.36]
[{"$f":"A423+1","v":68},{"$f":"B89","v":"Clover, Vetch (Prepared Seedbed)"},"A",5,10,6,{"$f":"G89","v":105},2.1,94.5,{"$f":"J89","v":120},0.68600000000000005,65.12]
[69,"Clover, Vetch (Sod Seeded)","A",30,60,56,105,2.1,94.5,120,0.68600000000000005,65.12]
[70,"Clover, Vetch + Ryegrass or Sm.Grain","A",55,110,106,105,2.1,94.5,120,0.68600000000000005,65.12]
[71,{"$f":"B130","v":"Dallis Grass (1 cutting plus grazing)"},"A",115,230,226,{"$f":"G130","v":65},1.3,58.5,{"$f":"J130","v":120},0.96,{"$f":"J427-($C$337*K427)","v":43.2}]
[72,"Dallis Grass, Grazing, 1AU/1 - 1.5 ac","A",115,230,226,65,1.3,{"$f":"G428-($C$336*H428)","v":58.5},120,0.96,43.2]
[73,"Dallis Grass, Grazing, 1AU/1.5 - 2 ac","A",95,190,186,65,1.3,58.5,120,0.96,43.2]
[74,"Desoto Grass","A",20,40,36,55,1.1000000000000001,49.5,120,0.96,43.2]
[75,{"$f":"B135","v":"Fescue, 3-4 AU/ac or Hay"},{"$f":"C135","v":"A"},{"$f":"D135","v":60},{"$f":"E135","v":120},116,{"$f":"G135","v":80},{"$f":"H135","v":1.6},72,{"$f":"J135","v":120},{"$f":"K135","v":0.96},43.2]
[76,{"$f":"B138","v":"Forage Sorghum"},{"$f":"C138","v":"A"},{"$f":"D138","v":20},{"$f":"E138","v":40},36,{"$f":"G138","v":55},{"$f":"H138","v":1.1000000000000001},49.5,{"$f":"J138","v":120},{"$f":"K138","v":0.96},43.2]
[77,{"$f":"B165","v":"Hay Grazer (1 cutting or light grazing)"},"A",40,80,76,{"$f":"G165","v":55},1.1000000000000001,49.5,{"$f":"J165","v":40},0.32,14.399999999999999]
[78,"Hay Grazer (2 cuttings or moderate grazing)","A",70,140,136,55,1.1000000000000001,49.5,120,0.96,43.2]
[79,"Hay Grazer (3 cuttings or heavy grazing)","A",100,200,196,105,2.1,94.5,120,0.96,43.2]
[80,{"$f":"B168","v":"Hegari"},"A",30,60,56,{"$f":"G168","v":80},{"$f":"H168","v":1.6},72,{"$f":"J168","v":60},{"$f":"K168","v":0.48},21.6]
[81,"Huban Clover","A",10,20,16,{"$f":"G169","v":80},{"$f":"H169","v":1.6},{"$f":"G437-($C$336*H437)","v":72},{"$f":"J169","v":60},{"$f":"K169","v":0.48},{"$f":"J437-($C$337*K437)","v":21.6}]
[82,{"$f":"B170","v":"Johnson Grass 1 cutting or light grazing"},"A",40,80,76,{"$f":"G170","v":55},1.1000000000000001,49.5,{"$f":"J170","v":40},0.32,14.399999999999999]
[83,"Johnson Grass 2 cuttings or moderate grazing","A",70,140,136,55,1.1000000000000001,49.5,40,0.32,14.399999999999999]
[84,"Johnson Grass 3 cuttings or heavy grazing","A",100,200,196,105,2.1,94.5,120,0.96,43.2]
[85,{"$f":"B174","v":"Kleingrass Grazing 1 AU/1.25 - 1.75 ac or Hay"},"A",75,150,146,{"$f":"G174","v":80},1.6,72,{"$f":"J174","v":120},0.96,43.2]
[86,"Kleingrass Grazing 1 AU/2 - 3 ac or Hay","A",65,110,106.61538461538461,55,1.1000000000000001,49.5,50,0.4,18]
[87,"Kleingrass Grazing 1 AU/4ac","A",40,80,76,55,1.1000000000000001,49.5,50,0.4,18]
[88,"Kleingrass Grazing 1 AU/6+ ac","A",25,50,46,55,1.1000000000000001,49.5,50,0.4,18]
[89,{"$f":"B182","v":"Lovegrass Grazing or Hay"},"A",35,70,66,{"$f":"G182","v":55},1.1000000000000001,49.5,{"$f":"J182","v":70},0.318,44.56]
[90,"Mexican Wheat","A",30,60,56,55,1.1000000000000001,49.5,60,0.32400000000000001,34.08]
[91,"Millet (1 hay cutting or light grazing)","A",20,40,36,55,1.1000000000000001,{"$f":"G447-($C$336*H447)","v":49.5},40,0.32,{"$f":"J447-($C$337*K447)","v":14.399999999999999}]
[92,"Millet (2 hay cutting or moderate grazing)","A",50,100,96,65,1.3,58.5,40,0.4,8]
[93,{"$f":"B189","v":"Oats Hay only, 2 - 3 T"},{"$f":"C189","v":"A"},{"$f":"D189","v":40},{"$f":"E189","v":80},76,{"$f":"G189","v":55},{"$f":"H189","v":1.1000000000000001},49.5,{"$f":"J189","v":40},0.32,14.399999999999999]
[94,{"$f":"B190","v":"Oats Heavy Grazing plus hay or grain"},"A",110,220,216,{"$f":"G190","v":80},1.6,72,120,0.96,43.2]
[95,"Oats Light Grazing","A",60,120,116,55,1.1000000000000001,49.5,60,0.48,21.6]
[96,"Oats Moderate Grazing","A",80,160,156,80,1.6,72,120,0.96,43.2]
[97,"Oats (Sod Seeded) Grazing","A",70,140,136,80,1.6,72,100,0.8,36]
[98,{"$f":"B208","v":"Range Grass Mix, <1000 lb Grazing"},"A",{"$f":"D208","v":5},10,6,20,0.4,{"$f":"G454-($C$336*H454)","v":18},30,0.24,{"$f":"J454-($C$337*K454)","v":10.8}]
[99,"Range Grass Mix, 1000-2000 lbGrazing","A",{"$f":"D209","v":10},20,16,{"$f":"G209","v":40},0.8,36,{"$f":"J209","v":60},0.48,21.6]
[100,"Range Grass Mix, >2000 Lb Grazing","A",20,40,36,55,1.1000000000000001,49.5,120,0.96,43.2]
[101,{"$f":"B211","v":"Red Top Cane, Grain"},{"$f":"C211","v":"A"},30,60,56,80,1.6,72,120,0.96,43.2]
[102,{"$f":"B212","v":"Rhodes Grass"},{"$f":"C212","v":"A"},20,40,{"$f":"IF(OR($C$335=\"\",D458=\"\",E458=\"\"),\"\",IF(OR(D458=0,E458=0),0,IF(C458=\"S\",((E458-(E458/D458*$C$335))*43.56),E458-(E458/D458*$C$335))))","v":36},65,1.3,58.5,120,0.96,43.2]
[103,{"$f":"B230","v":"Ryegrass, Heavy Grazing"},"A",100,200,196,{"$f":"G230","v":80},1.6,72,{"$f":"J230","v":120},0.96,43.2]
[104,"Ryegrass, Moderate Grazing","A",65,130,126,55,1.1000000000000001,49.5,120,0.96,43.2]
[105,"Ryegrass, Sod Seeded, Light Grazing","A",40,80,76,105,2.1,{"$f":"G461-($C$336*H461)","v":94.5},120,0.96,{"$f":"J461-($C$337*K461)","v":43.2}]
[106,{"$f":"B236","v":"Silage - Corn, 11 - 15 T"},"A",75,150,146,{"$f":"G236","v":105},2.1,{"$f":"G462-($C$336*H462)","v":94.5},{"$f":"J236","v":100},0.8,{"$f":"J462-($C$337*K462)","v":36}]
[107,"Silage - Corn, 16 - 20 T","A",100,200,196,105,2.1,94.5,120,0.96,43.2]
[108,"Silage - Corn, 21 - 25 T","A",125,250,246,105,2.1,94.5,120,0.96,43.2]
[109,"Silage - Corn, 26 - 30 T","A",150,300,296,155,3.1,139.5,160,1.28,57.599999999999994]
[110,"Silage - Corn, 7 - 10 T","A",50,100,96,80,1.6,72,55,0.44,19.799999999999997]
[111,"Silage - Sorghum, 11 - 15 T","A",65,130,126,105,2.1,94.5,100,0.8,36]
[112,"Silage - Sorghum, 16 - 20 T","A",90,180,176,105,2.1,94.5,120,0.96,43.2]
[113,"Silage - Sorghum, 21 - 25 T","A",110,220,216,105,2.1,94.5,120,0.96,43.2]
[114,"Silage - Sorghum, 26 - 30 T","A",130,260,256,130,2.6,117,160,1.28,57.599999999999994]
[115,"Silage - Sorghum, 7-10 T","A",35,70,66,80,1.6,72,55,0.44,19.799999999999997]
[116,"Sm. Grain or Ryegrass, Intensive Grazing","A",120,240,236,80,1.6,72,120,0.96,43.2]
[117,"Small Grain or Ryegrass, Moderate Grazing","A",90,180,176,80,1.6,72,120,0.96,43.2]
[118,"Sm.Grain or Ryegrass, Sod Seeded, Lt.Grazing","A",30,60,56,105,2.1,{"$f":"G474-($C$336*H474)","v":94.5},120,0.96,{"$f":"J474-($C$337*K474)","v":43.2}]
[119,{"$f":"B250","v":"Sorghum Alum"},"A",20,40,36,{"$f":"G250","v":55},{"$f":"H250","v":1.1000000000000001},{"$f":"G475-($C$336*H475)","v":49.5},{"$f":"J250","v":120},{"$f":"K250","v":0.96},{"$f":"J475-($C$337*K475)","v":43.2}]
[120,"Soybean ","A",5,10,6,{"$f":"G251","v":80},{"$f":"H251","v":1.6},72,{"$f":"J251","v":125},{"$f":"K251","v":0.71},68.2]
[121,{"$f":"B255","v":"Sudan - Sorg. Hybrid (1 cut or light graze)"},"A",40,80,76,{"$f":"G255","v":55},1.1000000000000001,49.5,{"$f":"J255","v":120},0.96,43.2]
[122,"Sudan - Sorg. Hybrid (2 cut or moderate graze)","A",70,140,136,55,1.1000000000000001,49.5,120,0.96,43.2]
[123,"Sudan - Sorg. Hybrid (3 cut or heavy graze)","A",100,200,196,105,2.1,94.5,120,0.96,43.2]
[124,"Sudan Grass (1 cutting or light grazing","A",40,80,76,55,1.1000000000000001,49.5,120,0.96,43.2]
[125,"Sudan Grass (2 cuttings or moderate grazing)","A",70,140,136,55,1.1000000000000001,49.5,120,0.96,43.2]
[126,"Sudan Grass (3 cuttings or heavy grazing)","A",100,200,196,105,2.1,94.5,120,0.96,43.2]
[127,{"$f":"B266","v":"Switchgrass Grazing"},{"$f":"C266","v":"A"},{"$f":"D266","v":20},{"$f":"E266","v":40},36,{"$f":"G266","v":55},{"$f":"H266","v":1.1000000000000001},49.5,{"$f":"J266","v":120},{"$f":"K266","v":0.96},43.2]
[128,{"$f":"B269","v":"Triticale, Grazing"},{"$f":"C269","v":"A"},{"$f":"D269","v":60},{"$f":"E269","v":120},116,{"$f":"G269","v":80},{"$f":"H269","v":1.6},72,{"$f":"J269","v":120},{"$f":"K269","v":0.96},43.2]
[129,{"$f":"B271","v":"Turnips - grazing"},{"$f":"C271","v":"A"},{"$f":"D271","v":70},{"$f":"E271","v":140},136,{"$f":"G271","v":105},{"$f":"H271","v":2.1},94.5,{"$f":"J271","v":120},{"$f":"K271","v":0.96},43.2]
[130,{"$f":"B274","v":"Vetch + Ryegrass or Sm. Grain"},{"$f":"C274","v":"A"},{"$f":"D274","v":70},{"$f":"E274","v":140},136,{"$f":"G274","v":105},{"$f":"H274","v":2.1},94.5,{"$f":"J274","v":120},{"$f":"K274","v":0.68600000000000005},65.12]
[131,{"$f":"B293","v":"Wheat Grass-Jose, Heavy Grazing"},"A",150,300,296,{"$f":"G293","v":130},{"$f":"H293","v":2.6},117,{"$f":"J293","v":120},{"$f":"K293","v":0.96},43.2]
[{"$f":"A487+1","v":132},"Wheat Grass-Jose, Light Grazing","A",75,150,146,{"$f":"G294","v":80},{"$f":"H294","v":1.6},72,{"$f":"J294","v":120},{"$f":"K294","v":0.96},43.2]
[133,{"$f":"B276","v":"Wheat (heavy grazing)"},"A",120,240,236,{"$f":"G276","v":105},2.1,94.5,{"$f":"J276","v":120},0.96,43.2]
[134,"Wheat (light grazing)","A",80,160,156,80,1.6,72,120,0.96,43.2]
[135,"Wheat (moderate grazing)","A",100,200,196,105,2.1,94.5,120,0.96,43.2]
[136,{"$f":"B280","v":"Wheat 20 - 29 bu grain + grazing"},{"$f":"C280","v":"A"},{"$f":"D280","v":45},{"$f":"E280","v":90},{"$f":"IF(OR($C$335=\"\",D492=\"\",E492=\"\"),\"\",IF(OR(D492=0,E492=0),0,IF(C492=\"S\",((E492-(E492/D492*$C$335))*43.56),E492-(E492/D492*$C$335))))","v":86},{"$f":"G280","v":30},{"$f":"H280","v":0.6},27,{"$f":"J280","v":120},{"$f":"K280","v":0.96},43.2]
[137,{"$f":"B282","v":"Wheat 30 - 39 bu grain + grazing"},{"$f":"C282","v":"A"},{"$f":"D282","v":65},{"$f":"E282","v":130},{"$f":"IF(OR($C$335=\"\",D493=\"\",E493=\"\"),\"\",IF(OR(D493=0,E493=0),0,IF(C493=\"S\",((E493-(E493/D493*$C$335))*43.56),E493-(E493/D493*$C$335))))","v":126},{"$f":"G282","v":55},{"$f":"H282","v":1.1000000000000001},49.5,{"$f":"J282","v":120},{"$f":"K282","v":0.96},43.2]
[138,{"$f":"B284","v":"Wheat 40 - 59 bu grain + grazing"},{"$f":"C284","v":"A"},{"$f":"D284","v":90},{"$f":"E284","v":180},{"$f":"IF(OR($C$335=\"\",D494=\"\",E494=\"\"),\"\",IF(OR(D494=0,E494=0),0,IF(C494=\"S\",((E494-(E494/D494*$C$335))*43.56),E494-(E494/D494*$C$335))))","v":176},{"$f":"G284","v":75},{"$f":"H284","v":1.5},67.5,{"$f":"J284","v":120},{"$f":"K284","v":0.96},43.2]
[139,{"$f":"B286","v":"Wheat 60 - 79 bu grain + grazing"},{"$f":"C286","v":"A"},{"$f":"D286","v":115},{"$f":"E286","v":230},{"$f":"IF(OR($C$335=\"\",D495=\"\",E495=\"\"),\"\",IF(OR(D495=0,E495=0),0,IF(C495=\"S\",((E495-(E495/D495*$C$335))*43.56),E495-(E495/D495*$C$335))))","v":226},{"$f":"G286","v":85},{"$f":"H286","v":1.7},76.5,{"$f":"J286","v":120},{"$f":"K286","v":0.96},43.2]
[140,{"$f":"B288","v":"Wheat 80 - 100 bu grain + grazing"},{"$f":"C288","v":"A"},{"$f":"D288","v":140},{"$f":"E288","v":280},{"$f":"IF(OR($C$335=\"\",D496=\"\",E496=\"\"),\"\",IF(OR(D496=0,E496=0),0,IF(C496=\"S\",((E496-(E496/D496*$C$335))*43.56),E496-(E496/D496*$C$335))))","v":276},{"$f":"G288","v":90},{"$f":"H288","v":1.8},81,{"$f":"J288","v":120},{"$f":"K288","v":0.96},43.2]
[141,{"$f":"B295","v":"Wheat Greenchop 2 Ton @ 75% moisture"},{"$f":"C293","v":"A"},150,300,{"$f":"IF(OR($C$335=\"\",D497=\"\",E497=\"\"),\"\",IF(OR(D497=0,E497=0),0,IF(C497=\"S\",((E497-(E497/D497*$C$335))*43.56),E497-(E497/D497*$C$335))))","v":296},{"$f":"G291","v":90},{"$f":"H293","v":2.6},77,{"$f":"J293","v":120},0.96,43.2]
[142,{"$f":"B296","v":"Wheat Greenchop 3 Ton @ 75% moisture"},"A",75,150,146,{"$f":"G292","v":90},{"$f":"H294","v":1.6},{"$f":"G498-($C$336*H498)","v":82},120,0.96,{"$f":"J498-($C$337*K498)","v":43.2}]
[143,"Wheat Greenchop 4 Ton @ 75% moisture","A",20,40,36,130,1.1000000000000001,124.5,120,0.96,43.2]
[144,"Wheat Greenchop 5 Ton @ 75% moisture","A",27.5,55,51,80,1.1000000000000001,74.5,120,0.96,43.2]
[145,"Wheat Greenchop 6 Ton @ 75% moisture","A",37.5,75,71,55,1.3,48.5,150,1,70]
[146,"Wheat Greenchop 7 Ton @ 75% moisture","A",47.5,95,91,55,1.3,48.5,150,1,70]
[147,"Wheat Greenchop 8 Ton @ 75% moisture","A",55,110,106,65,1.6,57,175,1.0940000000000001,87.47999999999999]
[148," Wheat Hay (1 Ton/ac)  ","A",65,130,126,65,1.6,57,175,1.0940000000000001,87.47999999999999]
[149," Wheat Hay (1.5 Ton/ac)  ","A",75,150,146,80,1.6,72,175,1.0940000000000001,87.47999999999999]
[150," Wheat Hay (2 Ton/ac)  ","A",22.5,45,41,80,1.1000000000000001,74.5,120,0.96,43.2]
[151," Wheat Hay (2.5 Ton/ac)  ","A",32.5,65,61,80,1.1000000000000001,74.5,120,0.96,43.2]
[152," Wheat Hay (3 Ton/ac)  ","A",45,90,86,55,1.3,48.5,120,0.96,43.2]
[153," Wheat Hay (3.5 Ton/ac)  ","A",55,110,106,55,1.3,48.5,150,1,70]
[154," Wheat Hay (4 Ton/ac)  ","A",67.5,135,131,65,1.6,57,150,1,70]
[155,"Wheat Silage 3 Ton @ 65% moisture","A",77.5,155,151,65,1.6,57,175,1.0940000000000001,87.47999999999999]
[156,"Wheat Silage 4.5 Ton @ 65% moisture","A",90,180,176,80,1.6,72,175,1.0940000000000001,87.47999999999999]
[157,"Wheat Silage 6 Ton @ 65% moisture","A",35,70,66,80,1.1000000000000001,74.5,120,0.96,43.2]
[158,"Wheat Silage 7.5 Ton @ 65% moisture","A",50,100,96,80,1.3,73.5,120,0.96,43.2]
[159,"Wheat Silage 9 Ton @ 65% moisture","A",70,140,136,55,1.3,48.5,150,1,70]
[null,"Oil Crops"]
[1,{"$f":"B136","v":"Flax"},{"$f":"C136","v":"A"},{"$f":"D136","v":20},{"$f":"E136","v":40},{"$f":"IF(OR($C$335=\"\",D517=\"\",E517=\"\"),\"\",IF(OR(D517=0,E517=0),0,IF(C517=\"S\",((E517-(E517/D517*$C$335))*43.56),E517-(E517/D517*$C$335))))","v":36},{"$f":"G136","v":56},{"$f":"H136","v":1.1299999999999999},{"$f":"G517-($C$336*H517)","v":50.35},{"$f":"J136","v":40},{"$f":"K136","v":0.32},{"$f":"J517-($C$337*K517)","v":14.399999999999999}]
[2,{"$f":"B164","v":"Guar"},{"$f":"C164","v":"A"},{"$f":"D164","v":10},{"$f":"E164","v":20},16,{"$f":"G164","v":81},{"$f":"H164","v":1.63},72.849999999999994,{"$f":"J164","v":60},{"$f":"K164","v":0.48},{"$f":"J518-($C$337*K518)","v":21.6}]
[3,{"$f":"B197","v":"Peanuts, Dryland, 1000 - 3500 lb"},"A",10,20,16,{"$f":"G197","v":69},{"$f":"H197","v":1.38},62.1,{"$f":"J197","v":61},{"$f":"K197","v":0.28999999999999998},{"$f":"J519-($C$337*K519)","v":37.799999999999997}]
[4,"Peanuts, Irrigated, 4000 - 5000 lb","A",10,20,16,{"$f":"G198","v":94},{"$f":"H198","v":1.88},84.6,{"$f":"J198","v":82},{"$f":"K198","v":0.39},50.8]
[5,{"$f":"B233","v":"Sesame"},{"$f":"C233","v":"A"},{"$f":"D233","v":25},{"$f":"E233","v":50},46,{"$f":"G233","v":81},{"$f":"H233","v":1.63},72.849999999999994,{"$f":"J233","v":50},{"$f":"K233","v":0.4},18]
[6,{"$f":"B251","v":"Soybean "},{"$f":"C251","v":"A"},{"$f":"D251","v":5},{"$f":"E251","v":10},6,{"$f":"G251","v":80},{"$f":"H251","v":1.6},72,{"$f":"J251","v":125},{"$f":"K251","v":0.71},68.2]
[7,{"$f":"B262","v":"Sunflowers"},{"$f":"C262","v":"A"},{"$f":"D262","v":15},{"$f":"E262","v":30},26,{"$f":"G262","v":56},{"$f":"H262","v":1.1299999999999999},50.35,{"$f":"J262","v":30},{"$f":"K262","v":0.24},10.8]
[null,"Vegetables, Nuts and Fruits"]
[1,{"$f":"B27","v":"Beans, Green"},"A",25,50,{"$f":"IF(OR($C$335=\"\",D525=\"\",E525=\"\"),\"\",IF(OR(D525=0,E525=0),0,IF(C525=\"S\",((E525-(E525/D525*$C$335))*43.56),E525-(E525/D525*$C$335))))","v":46},{"$f":"G27","v":106},2.13,{"$f":"G525-($C$336*H525)","v":95.35},{"$f":"J27","v":120},0.95,44]
[2,"Beans, Lima","A",25,50,46,106,2.13,95.35,120,0.95,44]
[3,"Beans, Pinto","A",25,50,46,106,2.13,95.35,120,0.95,44]
[4,"Beets","A",35,70,66,106,2.13,95.35,90,0.71,33.200000000000003]
[5,{"$f":"B73","v":"Blueberry"},{"$f":"C73","v":"A"},{"$f":"D73","v":30},{"$f":"E73","v":60},56,{"$f":"G73","v":31},{"$f":"H73","v":0.63},27.85,{"$f":"J73","v":0},{"$f":"K73","v":0},0]
[6,{"$f":"B76","v":"Broccoli - Field Production"},{"$f":"C76","v":"A"},{"$f":"D76","v":40},{"$f":"E76","v":80},76,{"$f":"G76","v":106},{"$f":"H76","v":1.77},97.15,{"$f":"J76","v":80},{"$f":"K76","v":0.64},28.799999999999997]
[7,{"$f":"B82","v":"Cabbage - Field Production"},"A",50,100,96,{"$f":"G82","v":131},{"$f":"H82","v":2.19},120.05,{"$f":"J82","v":160},{"$f":"K82","v":1.27},58.400000000000006]
[8,"Cabbage-Chinese","A",50,100,96,{"$f":"G83","v":131},{"$f":"H83","v":2.19},120.05,{"$f":"J83","v":160},{"$f":"K83","v":1.27},58.400000000000006]
[9,{"$f":"B85","v":"Cantaloupe - Field Production"},"A",20,40,36,{"$f":"G85","v":106},1.77,97.15,{"$f":"J85","v":80},0.64,28.799999999999997]
[10,"Carrots - Field Production","A",40,80,76,106,2.13,95.35,120,0.95,44]
[11,"Cauliflower - Field Production","A",40,80,76,106,2.13,95.35,120,0.95,44]
[12,"Citrus","A",50,100,96,81,1.63,72.849999999999994,130,0.95,54]
[13,{"$f":"B92","v":"Collards"},{"$f":"C92","v":"A"},{"$f":"D92","v":40},{"$f":"E92","v":80},76,{"$f":"G92","v":106},{"$f":"H92","v":2.13},95.35,{"$f":"J92","v":120},{"$f":"K92","v":0.95},44]
[14,{"$f":"B129","v":"Cucumbers - Field Production"},{"$f":"C129","v":"A"},{"$f":"D129","v":40},{"$f":"E129","v":80},76,{"$f":"G129","v":106},{"$f":"H129","v":1.77},97.15,{"$f":"J129","v":80},{"$f":"K129","v":0.64},28.799999999999997]
[15,{"$f":"B134","v":"Eggplant - Field Production"},{"$f":"C134","v":"A"},{"$f":"D134","v":60},{"$f":"E134","v":120},116,{"$f":"G134","v":106},{"$f":"H134","v":1.77},97.15,{"$f":"J134","v":120},{"$f":"K134","v":0.95},44]
[16,{"$f":"B141","v":"Garlic"},{"$f":"C141","v":"A"},{"$f":"D141","v":50},{"$f":"E141","v":100},96,{"$f":"G141","v":131},{"$f":"H141","v":2.63},117.85,{"$f":"J141","v":100},{"$f":"K141","v":0.79},36.799999999999997]
[17,{"$f":"B163","v":"Grapes - Field Production"},{"$f":"C163","v":"A"},{"$f":"D163","v":12.5},{"$f":"E163","v":25},21,{"$f":"G163","v":31},{"$f":"H163","v":0.63},27.85,{"$f":"J163","v":50},{"$f":"K163","v":0.33},23.599999999999998]
[18,{"$f":"B186","v":"Mustard"},{"$f":"C186","v":"A"},{"$f":"D186","v":25},{"$f":"E186","v":50},46,{"$f":"G186","v":106},{"$f":"H186","v":2.13},95.35,{"$f":"J186","v":120},{"$f":"K186","v":0.95},44]
[19,{"$f":"B194","v":"Okra"},"A",20,40,36,{"$f":"G194","v":81},1.63,72.849999999999994,{"$f":"J194","v":80},0.64,28.799999999999997]
[20,"Onions ","A",50,100,96,131,2.63,117.85,100,0.79,36.799999999999997]
[21,"Peaches - Production","A",20,40,36,50,1,45,150,0.95,74]
[22,{"$f":"B199","v":"Peas, Blackeye"},"A",10,20,16,{"$f":"G199","v":56},1.1299999999999999,50.35,{"$f":"J199","v":40},0.32,14.399999999999999]
[23,"Peas, Green","A",30,60,56,56,1.1299999999999999,50.35,40,0.32,14.399999999999999]
[24,"Pecans, individual trees","S",60,3,126.324,4,0.08,3.6,0,0,0]
[25,"Pecans, Upland Groves","A",74,148,144,81,1.63,72.849999999999994,100,1,20]
[26,"Peppers, Bell","A",60,120,116,106,2.13,95.35,120,0.95,44]
[27,"Peppers, Chile","A",30,60,56,106,2.13,95.35,120,0.95,44]
[28,"Potatoes  (early variety)","A",80,160,156,250,4.17,229.15,100,0.79,36.799999999999997]
[29,"Potatoes  (late variety)","A",100,200,196,250,4.17,229.15,100,0.79,36.799999999999997]
[30,"Radishes","A",30,60,56,106,2.13,95.35,120,0.95,44]
[31,{"$f":"B252","v":"Spinach "},"A",20,40,36,{"$f":"G252","v":106},2.13,95.35,{"$f":"J252","v":120},0.95,44]
[32,"Squash, Summer or Winter","A",20,40,36,106,2.13,95.35,80,0.64,28.799999999999997]
[33,"Strawberries","A",20,40,36,106,2.13,95.35,120,0.95,44]
[34,{"$f":"B263","v":"Sweet Corn "},"A",60,120,116,{"$f":"G263","v":106},2.13,95.35,{"$f":"J263","v":80},0.64,28.799999999999997]
[35,"Sweet Potatoes","A",15,30,26,156,3.13,140.35,200,1.1399999999999999,108.80000000000001]
[36,"Swiss Chard","A",60,120,116,81,1.63,72.849999999999994,90,0.71,33.200000000000003]
[37,{"$f":"B267","v":"Tomatoes "},{"$f":"C267","v":"A"},{"$f":"D267","v":30},{"$f":"E267","v":60},56,{"$f":"G267","v":131},{"$f":"H267","v":2.63},117.85,{"$f":"J267","v":160},{"$f":"K267","v":1.27},58.400000000000006]
[38,{"$f":"B271","v":"Turnips - grazing"},"A",70,140,136,{"$f":"G271","v":105},2.1,94.5,{"$f":"J271","v":120},0.96,43.2]
[39,"Turnips - production","A",30,60,56,106,2.13,95.35,120,0.95,44]
[40,"Vegetables, Truck Farming","A",90,180,176,131,2.63,117.85,160,1.27,58.400000000000006]
[41,{"$f":"B275","v":"Watermelons "},{"$f":"C275","v":"A"},{"$f":"D275","v":40},{"$f":"E275","v":80},76,{"$f":"G275","v":56},{"$f":"H275","v":1.1299999999999999},50.35,{"$f":"J275","v":60},{"$f":"K275","v":0.48},21.6]
[null,"Row Crops and Grain"]
[1,{"$f":"B22","v":"Barley 30 - 40 bu"},"A",25,50,{"$f":"IF(OR($C$335=\"\",D567=\"\",E567=\"\"),\"\",IF(OR(D567=0,E567=0),0,IF(C567=\"S\",((E567-(E567/D567*$C$335))*43.56),E567-(E567/D567*$C$335))))","v":46},{"$f":"G22","v":55},{"$f":"H22","v":1.1000000000000001},{"$f":"G567-($C$336*H567)","v":49.5},{"$f":"J22","v":40},{"$f":"K22","v":0.32},14.399999999999999]
[{"$f":"A567+1","v":2},"Barley 70 - 90 bu","A",50,100,{"$f":"IF(OR($C$335=\"\",D568=\"\",E568=\"\"),\"\",IF(OR(D568=0,E568=0),0,IF(C568=\"S\",((E568-(E568/D568*$C$335))*43.56),E568-(E568/D568*$C$335))))","v":96},{"$f":"G23","v":80},{"$f":"H23","v":1.6},72,{"$f":"J23","v":90},{"$f":"K23","v":0.71},33.200000000000003]
[{"$f":"A568+1","v":3},{"$f":"B93","v":"Corn 100 bu"},"A",{"$f":"D93","v":60},{"$f":"E93","v":120},{"$f":"IF(OR($C$335=\"\",D93=\"\",E93=\"\"),\"\",IF(OR(D93=0,E93=0),0,IF(C569=\"S\",((E93-(E93/D93*$C$335))*43.56),E93-(E93/D93*$C$335))))","v":116},{"$f":"G93","v":80},1.6,72,{"$f":"J93","v":110},{"$f":"K93","v":0.75},50]
[4,"Corn 110 bu","A",60,120,116,105,2.1,94.5,{"$f":"J94","v":110},{"$f":"K94","v":0.75},50]
[5,"Corn 120 bu","A",72,144,140,105,2.1,94.5,130,{"$f":"K106","v":1.1000000000000001},42]
[6,"Corn 130 bu","A",72,144,140,105,2.1,94.5,130,1.05,46]
[7,"Corn 140 bu","A",82,164,160,105,2.1,94.5,130,1.05,46]
[8,"Corn 150 bu","A",82,164,160,105,2.1,94.5,130,1.05,46]
[9,"Corn 160 bu","A",90,180,176,130,2.6,117,140,1.05,56]
[10,{"$f":"B100","v":"Corn 170 bu"},"A",90,180,176,{"$f":"G100","v":130},2.6,{"$f":"G576-($C$336*H576)","v":117},140,{"$f":"K111","v":0.64},{"$f":"J576-($C$337*K576)","v":88.8}]
[11,"Corn 180 bu","A",105,210,206,130,2.6,117,140,0.64,88.8]
[12,"Corn 190 bu","A",105,210,206,130,2.6,117,140,0.75,80]
[13,"Corn 200 bu","A",125,250,246,130,2.6,117,140,0.24,120.8]
[14,{"$f":"B104","v":"Corn 210 bu"},"A",{"$f":"D104","v":125},250,246,150,3,135,140,0.24,120.8]
[15,"Corn 220 bu","A",140,280,276,150,3,135,150,0.24,130.80000000000001]
[16,"Corn 230 bu","A",140,280,276,150,3,135,150,0.4,118]
[17,"Corn 240 bu","A",150,300,296,150,3,135,150,0.4,118]
[18,"Corn 250 bu","A",150,300,296,175,3.5,157.5,150,0.95,74]
[19,"Corn 260 bu","A",160,320,316,175,3.5,157.5,150,0.95,74]
[20,"Corn 270 bu","A",160,320,316,175,3.5,157.5,150,0.95,74]
[21,{"$f":"B111","v":"Corn 70 bu or less"},"A",45,90,86,{"$f":"G111","v":80},1.6,72,{"$f":"J111","v":80},0.64,28.799999999999997]
[22,"Corn 80 bu","A",{"$f":"D112","v":60},{"$f":"E112","v":120},116,80,1.6,72,80,0.64,28.799999999999997]
[23,"Corn 90 bu","A",60,120,116,80,1.6,72,80,0.75,20]
[24,"Cotton 0.5 bale","A",12.5,25,21,55,1.1000000000000001,49.5,30,0.24,10.8]
[25,"Cotton 0.75 bale","A",18.75,37.5,33.5,55,1.1000000000000001,49.5,30,0.24,10.8]
[26,"Cotton 1 bale","A",25,50,46,55,1.1000000000000001,49.5,30,0.24,{"$f":"J592-($C$337*K592)","v":10.8}]
[27,"Cotton 1.25 bale","A",31.25,62.5,58.5,80,1.6,72,50,0.4,18]
[28,"Cotton 1.5 bale","A",37.5,75,71,80,1.6,72,50,0.4,18]
[29,"Cotton 1.75 bale","A",43.75,87.5,83.5,105,2.1,94.5,120,0.95,44]
[30,"Cotton 2 bale","A",50,100,96,105,2.1,94.5,120,0.95,44]
[31,"Cotton 2.25 bale","A",56.25,112.5,108.5,105,2.1,94.5,120,0.95,44]
[32,"Cotton 2.5 bale","A",62.5,125,121,105,2.1,94.5,120,0.95,44]
[33,"Cotton 2.75 bale","A",68.75,137.5,133.5,105,2.1,94.5,120,0.95,44]
[34,"Cotton 3 bale","A",75,150,146,120,2.4,108,120,0.95,44]
[35,{"$f":"B125","v":"Cotton 3.5 bale"},"A",87.5,175,{"$f":"IF(OR($C$335=\"\",D601=\"\",E601=\"\"),\"\",IF(OR(D601=0,E601=0),0,IF(C601=\"S\",((E601-(E601/D601*$C$335))*43.56),E601-(E601/D601*$C$335))))","v":171},{"$f":"G125","v":120},2.4,{"$f":"G601-($C$336*H601)","v":108},{"$f":"J125","v":120},0.95,{"$f":"J601-($C$337*K601)","v":44}]
[36,"Cotton 4.0 bale","A",100,200,{"$f":"IF(OR($C$335=\"\",D602=\"\",E602=\"\"),\"\",IF(OR(D602=0,E602=0),0,IF(C602=\"S\",((E602-(E602/D602*$C$335))*43.56),E602-(E602/D602*$C$335))))","v":196},130,2.6,{"$f":"G602-($C$336*H602)","v":117},120,0.95,{"$f":"J602-($C$337*K602)","v":44}]
[37,"Cotton 4.5 bale","A",112.5,225,{"$f":"IF(OR($C$335=\"\",D603=\"\",E603=\"\"),\"\",IF(OR(D603=0,E603=0),0,IF(C603=\"S\",((E603-(E603/D603*$C$335))*43.56),E603-(E603/D603*$C$335))))","v":221},130,2.6,{"$f":"G603-($C$336*H603)","v":117},120,0.95,{"$f":"J603-($C$337*K603)","v":44}]
[38,"Cotton 5.0 bale","A",125,250,{"$f":"IF(OR($C$335=\"\",D604=\"\",E604=\"\"),\"\",IF(OR(D604=0,E604=0),0,IF(C604=\"S\",((E604-(E604/D604*$C$335))*43.56),E604-(E604/D604*$C$335))))","v":246},140,2.8,{"$f":"G604-($C$336*H604)","v":126},120,0.95,{"$f":"J604-($C$337*K604)","v":44}]
[39,{"$f":"B144","v":"Grain Sorghum 1000 lb"},"A",10,20,16,{"$f":"G144","v":30},0.6,27,{"$f":"J144","v":10},0.16,-2.8000000000000007]
[40,"Grain Sorghum 1500 lb","A",15,30,26,30,0.6,27,15,0.16,2.1999999999999993]
[41,"Grain Sorghum 2000 lb","A",20,40,36,40,0.8,36,20,0.16,7.1999999999999993]
[42,"Grain Sorghum 2500 lb","A",25,50,46,50,1,45,60,0.64,8.7999999999999972]
[43,"Grain Sorghum 3000 lb","A",30,60,56,55,1.1000000000000001,49.5,60,0.64,8.7999999999999972]
[44,"Grain Sorghum 3500 lb","A",35,70,66,60,1.2,54,70,0.64,18.799999999999997]
[45,"Grain Sorghum 4000 lb","A",40,80,76,65,1.3,{"$f":"G611-($C$336*H611)","v":58.5},80,0.64,28.799999999999997]
[46,"Grain Sorghum 4500 lb","A",45,90,86,75,1.5,{"$f":"G612-($C$336*H612)","v":67.5},100,0.79,36.799999999999997]
[47,"Grain Sorghum 5000 lb","A",50,100,96,80,1.6,72,100,0.79,36.799999999999997]
[48,"Grain Sorghum 5500 lb","A",55,110,106,90,1.8,81,100,0.79,36.799999999999997]
[49,"Grain Sorghum 6000 lb","A",60,120,116,105,2.1,94.5,100,0.79,36.799999999999997]
[50,"Grain Sorghum 6500 lb","A",65,130,126,120,2.4,108,120,0.95,44]
[51,"Grain Sorghum 7000 lb","A",70,140,136,130,2.6,117,120,0.95,44]
[52,"Grain Sorghum 7500 lb","A",75,150,146,135,2.7,121.5,120,0.95,44]
[53,"Grain Sorghum 8000 lb","A",80,160,156,140,2.8,126,120,0.95,44]
[54,{"$f":"B159","v":"Grain Sorghum 8500 lb"},"A",85,170,166,{"$f":"G159","v":150},3,135,{"$f":"J159","v":140},1.1060000000000001,51.519999999999996]
[55,"Grain Sorghum 9000 lb","A",90,180,176,160,3.2,144,140,1.1060000000000001,51.519999999999996]
[56,"Grain Sorghum 9500 lb","A",95,190,186,170,3.4,153,140,1.1060000000000001,51.519999999999996]
[57,"Grain Sorghum 10000 lb","A",100,200,196,180,3.6,162,140,1.1060000000000001,51.519999999999996]
[58,{"$f":"B168","v":"Hegari"},{"$f":"C168","v":"A"},{"$f":"D168","v":30},{"$f":"E168","v":60},56,{"$f":"G168","v":80},{"$f":"H168","v":1.6},72,{"$f":"J168","v":60},{"$f":"K168","v":0.48},21.6]
[59,{"$f":"B187","v":"Oats 60 - 80 Bu"},"A",40,80,76,{"$f":"G187","v":55},{"$f":"H187","v":1.1000000000000001},49.5,{"$f":"J187","v":40},{"$f":"K187","v":0.32},14.399999999999999]
[60,"Oats 81 - 100 Bu","A",50,100,96,{"$f":"G188","v":105},{"$f":"H188","v":2.1},94.5,{"$f":"J188","v":100},{"$f":"K188","v":0.79},36.799999999999997]
[61,{"$f":"B213","v":"Rice, Early (Rice Guide)"},"A",92.5,185,181,45,1.8,36,40,{"$f":"K213","v":0.8},-24]
[62,{"$f":"B214","v":"Rice, Late(Rice Guide)"},"A",85,170,166,{"$f":"G214","v":45},1.8,36,{"$f":"J214","v":40},{"$f":"K214","v":0.8},-24]
[63,"Rice, Early w/Ratoon(Rice Guide)","A",147.5,295,291,60,1.8,51,{"$f":"J215","v":40},{"$f":"K215","v":0.8},-24]
[64,{"$f":"B216","v":"Rice, Late w/Ratoon(Rice Guide)"},"A",142.5,285,281,60,1.8,51,{"$f":"J216","v":40},{"$f":"K216","v":0.8},-24]
[65,"Rice Fallow (Not Grazed)","A",0,0,0,0,0,0,{"$f":"J217","v":0},{"$f":"K217","v":0},0]
[66,{"$f":"B218","v":"Rice (Eastern Belt - Clay soils)"},"A",87.5,175,171,{"$f":"G218","v":45},1.8,36,{"$f":"J218","v":40},0.8,-24]
[67,"Rice (Eastern Belt - Sandy soils)","A",75,150,146,45,1.8,36,40,0.8,-24]
[68,"Rice (Western Belt - Clay soils)","A",87.5,175,171,45,1.8,36,40,0.8,-24]
[69,"Rice (Western Belt - Sandy soils)","A",75,150,146,45,1.8,36,40,0.8,-24]
[70,"Rice-Flooded (Eastern Belt - Clay soils)","A",90,180,176,45,1.8,36,40,0.8,-24]
[71,"Rice-Flooded (Eastern Belt - Sandy soils)","A",90,180,176,45,1.8,36,40,0.8,-24]
[72,"Rice-Flooded (Western Belt - Clay soils)","A",90,180,176,45,1.8,36,40,0.8,-24]
[73,"Rice-Flooded (Western Belt - Sandy soils)","A",90,180,176,45,1.8,36,40,0.8,-24]
[74,{"$f":"B227","v":"Rye, Grain"},"A",35,70,66,{"$f":"G227","v":55},1.1000000000000001,49.5,{"$f":"J227","v":120},0.95,44]
[{"$f":"A640+1","v":75},"Rye, Heavy Grazing","A",140,280,276,80,1.6,72,120,0.96,43.2]
[76,"Rye, Moderate Grazing","A",70,140,136,55,1.1000000000000001,49.5,120,0.96,43.2]
[77,{"$f":"B251","v":"Soybean "},"A",5,10,6,81,1.63,72.849999999999994,125,0.71,68.2]
[78,{"$f":"B261","v":"Sugarcane"},{"$f":"C261","v":"A"},{"$f":"D261","v":85},{"$f":"E261","v":170},166,{"$f":"G261","v":106},{"$f":"H261","v":2.13},95.35,{"$f":"J261","v":150},{"$f":"K261","v":0.95},74]
[79,{"$f":"B279","v":"Wheat 100 bu grain only"},{"$f":"C279","v":"A"},{"$f":"D279","v":75},{"$f":"E279","v":150},146,{"$f":"G279","v":90},{"$f":"H279","v":1.8},81,{"$f":"J279","v":120},{"$f":"K279","v":0.95},44]
[80,{"$f":"B281","v":"Wheat 20 bu grain only"},{"$f":"C281","v":"A"},{"$f":"D281","v":22},44,40,30,0.6,27,120,0.95,44]
[81,{"$f":"B283","v":"Wheat 30 bu grain only"},{"$f":"C283","v":"A"},{"$f":"D283","v":30},60,56,55,1.1000000000000001,49.5,120,0.95,44]
[82,{"$f":"B285","v":"Wheat 40 bu grain only"},{"$f":"C285","v":"A"},{"$f":"D285","v":38},{"$f":"E285","v":76},72,{"$f":"G285","v":75},{"$f":"H285","v":1.5},67.5,{"$f":"J285","v":120},{"$f":"K285","v":0.95},44]
[83,{"$f":"B287","v":"Wheat 50 bu grain only"},{"$f":"C287","v":"A"},{"$f":"D287","v":45},{"$f":"E287","v":90},86,{"$f":"G287","v":75},{"$f":"H287","v":1.5},67.5,{"$f":"J287","v":120},{"$f":"K287","v":0.95},44]
[84,{"$f":"B289","v":"Wheat 60 bu grain only"},"A",52,105,100.96153846153847,{"$f":"G289","v":85},1.7,76.5,{"$f":"J289","v":120},0.95,44]
[85,"Wheat 70 bu grain only","A",60,120,116,85,1.7,76.5,120,0.95,44]
[86,"Wheat 80 bu grain only","A",68,136,132,90,1.8,81,120,0.95,44]
[87,"Wheat 90 bu grain only","A",75,150,146,90,1.8,81,120,0.95,44]
[]
[null,"Turf and Landscape"]
[1,{"$f":"B10","v":"Athletic Fields - Low, Moderate or High Maintenance"},{"$f":"C10","v":"A"},{"$f":"D10","v":30},{"$f":"E10","v":60},56,{"$f":"G10","v":38},{"$f":"H10","v":0.75},34.25,{"$f":"J10","v":150},{"$f":"K10","v":0.95},74]
[2,{"$f":"B142","v":"Golf Greens - Native and Pushup"},"S",30,1.5,60.984000000000002,{"$f":"G142","v":100},{"$f":"H142","v":2},90,{"$f":"J142","v":0},{"$f":"K142","v":0},0]
[3,"Golf Greens - Sand Based","S",30,1.5,{"$f":"IF(OR($C$335=\"\",D658=\"\",E658=\"\"),\"\",IF(OR(D658=0,E658=0),0,IF(C658=\"S\",((E658-(E658/D658*$C$335))*43.56),E658-(E658/D658*$C$335))))","v":60.984000000000002},{"$f":"G143","v":100},{"$f":"H143","v":2},90,{"$f":"J143","v":0},{"$f":"K143","v":0},0]
[4,{"$f":"B249","v":"Sodgrass Production"},{"$f":"C249","v":"A"},{"$f":"D249","v":40},{"$f":"E249","v":80},76,{"$f":"G249","v":106},{"$f":"H249","v":2.13},95.35,{"$f":"J249","v":160},{"$f":"K249","v":1.27},58.400000000000006]
[5,{"$f":"B270","v":"Turf Fairways - Low, Mod. or High Maint."},{"$f":"C270","v":"A"},{"$f":"D270","v":30},{"$f":"E270","v":60},56,{"$f":"G270","v":56},{"$f":"H270","v":1.1299999999999999},50.35,{"$f":"J270","v":150},{"$f":"K270","v":0.95},74]
[null,"Fiber Crops"]
[1,{"$f":"B114","v":"Cotton 0.5 bale"},"A",12.5,25,21,{"$f":"G114","v":55},1.1000000000000001,49.5,{"$f":"J114","v":30},0.24,10.8]
[{"$f":"A662+1","v":2},"Cotton 0.75 bale","A",18.75,37.5,33.5,55,1.1000000000000001,49.5,30,0.24,10.8]
[{"$f":"A663+1","v":3},"Cotton 1 bale","A",25,50,46,55,1.1000000000000001,49.5,30,0.24,10.8]
[4,"Cotton 1.25 bale","A",31.25,62.5,58.5,80,1.6,72,50,0.4,18]
[5,"Cotton 1.5 bale","A",37.5,75,71,80,1.6,72,50,0.4,18]
[6,"Cotton 1.75 bale","A",43.75,87.5,83.5,105,2.1,94.5,120,0.95,44]
[7,"Cotton 2 bale","A",50,100,96,105,2.1,94.5,120,0.95,44]
[8,"Cotton 2.25 bale","A",56.25,112.5,108.5,105,2.1,94.5,120,0.95,44]
[9,"Cotton 2.5 bale","A",62.5,125,121,105,2.1,94.5,120,0.95,44]
[10,"Cotton 2.75 bale","A",68.75,137.5,133.5,105,2.1,94.5,120,0.95,44]
[11,"Cotton 3 bale","A",75,150,146,120,2.4,108,120,0.95,44]
[12,{"$f":"B125","v":"Cotton 3.5 bale"},"A",87.5,175,{"$f":"IF(OR($C$335=\"\",D673=\"\",E673=\"\"),\"\",IF(OR(D673=0,E673=0),0,IF(C673=\"S\",((E673-(E673/D673*$C$335))*43.56),E673-(E673/D673*$C$335))))","v":171},{"$f":"G125","v":120},2.4,{"$f":"G673-($C$336*H673)","v":108},{"$f":"J125","v":120},0.95,{"$f":"J673-($C$337*K673)","v":44}]
[13,"Cotton 4.0 bale","A",100,200,{"$f":"IF(OR($C$335=\"\",D674=\"\",E674=\"\"),\"\",IF(OR(D674=0,E674=0),0,IF(C674=\"S\",((E674-(E674/D674*$C$335))*43.56),E674-(E674/D674*$C$335))))","v":196},130,2.6,{"$f":"G674-($C$336*H674)","v":117},120,0.95,{"$f":"J674-($C$337*K674)","v":44}]
[14,"Cotton 4.5 bale","A",112.5,225,{"$f":"IF(OR($C$335=\"\",D675=\"\",E675=\"\"),\"\",IF(OR(D675=0,E675=0),0,IF(C675=\"S\",((E675-(E675/D675*$C$335))*43.56),E675-(E675/D675*$C$335))))","v":221},130,2.6,{"$f":"G675-($C$336*H675)","v":117},120,0.95,{"$f":"J675-($C$337*K675)","v":44}]
[15,"Cotton 5.0 bale","A",125,250,{"$f":"IF(OR($C$335=\"\",D676=\"\",E676=\"\"),\"\",IF(OR(D676=0,E676=0),0,IF(C676=\"S\",((E676-(E676/D676*$C$335))*43.56),E676-(E676/D676*$C$335))))","v":246},140,2.8,{"$f":"G676-($C$336*H676)","v":126},120,0.95,{"$f":"J676-($C$337*K676)","v":44}]
[16,{"$f":"B173","v":"Kenaf"},{"$f":"C173","v":"A"},{"$f":"D173","v":50},{"$f":"E173","v":100},96,{"$f":"G173","v":65},{"$f":"H173","v":1.3},58.5,{"$f":"J173","v":120},{"$f":"K173","v":0.95},{"$f":"J677-($C$337*K677)","v":44}]
[null,"Grass Establishment"]
[1,{"$f":"B315","v":"Alfalfa - Irr. Est."},"A",10,20,16,{"$f":"G315","v":130},2.1669999999999998,119.16500000000001,{"$f":"J315","v":160},1.28,57.599999999999994,null,{"$f":"N315","v":0},0,{"$f":"IF(N679=0,0,IF((($C$335*2)-O679)<=0,N679,IF(N679-(($C$335*2)-O679)<=0,0,(N679-(($C$335*2)-O679)))))","v":0}]
[{"$f":"A679+1","v":2},"Alfalfa - Non-Irr. Est.","A",10,20,16,80,1.333,73.334999999999994,120,0.96,43.2,null,0,0,{"$f":"IF(N680=0,0,IF((($C$335*2)-O680)<=0,N680,IF(N680-(($C$335*2)-O680)<=0,0,(N680-(($C$335*2)-O680)))))","v":0}]
[{"$f":"A680+1","v":3},"Bahiagrass - Est.","A",20,40,36,105,2.1,94.5,120,0.96,43.2,null,40,40,40]
[4,"Bermudagrass, Common - Est.","A",20,40,36,105,2.1,94.5,100,0.8,36,null,0,0,0]
[5,"Bermudagrass, Improved - Irr. Est.","A",20,40,36,105,2.1,94.5,100,0.8,36,null,40,40,40]
[6,"Bermudagrass, Improved - non-irr. Est","A",20,40,36,105,2.1,94.5,100,0.8,36,null,40,40,40]
[7,"Bermudagrass, NK-37 or Midland - Est","A",20,40,36,55,1.1000000000000001,49.5,40,0.88900000000000001,-31.120000000000005,null,0,0,0]
[8,"Blue Panic - Est.","A",20,40,36,55,1.1000000000000001,49.5,40,0.32,14.399999999999999,null,0,0,0]
[9,"Bluestems - Est","A",20,40,36,55,1.1000000000000001,49.5,40,0.32,14.399999999999999,null,0,0,0]
[10,"Buffelgrass - Est","A",20,40,36,105,2.1,94.5,120,0.96,43.2,null,40,40,40]
[11,"Dallisgrass - Est","A",20,40,36,105,2.1,{"$f":"G689-($C$336*H689)","v":94.5},120,0.96,43.2,null,40,40,40]
[12,"Fescue Est.","A",20,40,36,80,1.6,72,60,0.48,21.6,null,0,0,0]
[13,"Kleingrass - Est.","A",20,40,36,55,1.1000000000000001,49.5,60,0.48,21.6,null,0,0,{"$f":"IF(N691=0,0,IF((($C$335*2)-O691)<=0,N691,IF(N691-(($C$335*2)-O691)<=0,0,(N691-(($C$335*2)-O691)))))","v":0}]
[14,"Lawn - Est.","AS",12,0.57999999999999996,{"$f":"IF(OR($C$335=\"\",D692=\"\",E692=\"\"),\"\",IF(OR(D692=0,E692=0),0,IF(C692=\"AS\",((E692-(E692/D692*$C$335))*43.56),E692-(E692/D692*$C$335))))","v":21.053999999999998},4,0.08,3.6,0,0,0,null,0,0,0]
[15,"Lovegrass - Est.","A",20,40,36,55,1.1000000000000001,49.5,40,0.32,14.399999999999999,null,0,0,0]
[16,"Peach - Est.","A",20,40,36,75,1.5,67.5,150,0.95,74,null,0,0,0]
[17,"Range Grass Mix - Est","A",20,40,36,55,1.1000000000000001,49.5,40,0.32,14.399999999999999,null,0,0,{"$f":"IF(N695=0,0,IF((($C$335*2)-O695)<=0,N695,IF(N695-(($C$335*2)-O695)<=0,0,(N695-(($C$335*2)-O695)))))","v":0}]
[18,"Rhodesgrass - Est.","A",20,40,36,105,2.1,94.5,120,0.96,43.2,null,40,40,40]
[19,"Switchgrass - Est.","A",20,40,36,55,1.1000000000000001,49.5,120,0.96,43.2,null,0,0,0]
[]
["1/","Forage numbers revised 3/1/07 based on TAMU, Forage N recs. posted 12/11/06, Forage P recs. posted 11/29/06, and Forage K recs. posted 12/11/06"]

{"sheet":"Jobsheet1","index":6,"n_rows":18,"n_cols":12,"rows_kept":18,"cut":false,"hidden":false,"merged":[[1,0,1,11],[12,3,12,6],[0,2,0,5],[12,7,12,8],[8,7,8,8],[9,2,9,3],[6,7,7,8],[0,7,0,11],[6,9,7,9],[6,10,7,10],[9,7,9,8],[10,7,10,8],[11,7,11,8],[10,0,11,2],[6,0,9,0],[6,2,6,3],[7,2,7,3],[13,0,16,0],[14,1,14,4],[17,0,17,11],[15,1,15,4],[16,1,16,11],[15,6,15,8],[13,9,13,11],[13,1,13,8],[14,5,14,8],[4,9,4,11],[5,9,5,11],[2,1,2,9],[4,1,4,4],[5,1,5,4],[8,2,8,3],[6,11,7,11]]}
[null,null,null,null,null,null,null,"No Direct Entry On This Page"]
["Plan for Establishment Year Only"]
[null,"NUTRIENT MANAGEMENT JOBSHEET AND SPECIFICATIONS"]
[]
["Landuser :",{"$f":"IF(Entry!$H$3=\"\",\"\",IF(Entry!$C$1=\"\",\"\",Entry!$C$1))","v":""},null,null,null,null,null,null,"Date :",{"$f":"IF(Entry!$H$3=\"\",\"\",IF($B$5=\"\",\"\",TODAY()))","v":""}]
["Assisted By :",{"$f":"IF(Entry!$H$3=\"\",\"\",IF(Entry!$C$3=\"\",\"\",Entry!$C$3))","v":""},null,null,null,null,null,null,"Field No :",{"$f":"IF(Entry!$H$3=\"\",\"\",IF(Entry!$C$2=\"\",\"\",Entry!$C$2))","v":""}]
["PURPOSE    (Mark All     That Apply)",null,"Optimum Yield",null,null,{"$f":"IF(Entry!$H$3=\"\",\"\",IF(Entry!$F$2=\"\",\"\",Entry!$F$2))","v":""},null,"Credits From Various Sources",null,"N","P2O5","K2O"]
[null,null,"Quick Cover",null,null,{"$f":"IF(Entry!$H$3=\"\",\"\",IF(Entry!$F$3=\"\",\"\",Entry!$F$3))","v":""}]
[null,null,"Water Quality",null,null,{"$f":"IF(Entry!$H$3=\"\",\"\",IF(Entry!$F$4=\"\",\"\",Entry!$F$4))","v":""},null,{"$f":"IF(Entry!$H$3=\"\",\"\",IF(Entry!$C$4=\"\",\"\",+\"YEAR 1        (\"&Entry!$C$4&\")\"))","v":""},null,{"$f":"IF(Entry!$H$3=\"\",\"\",IF(Entry!$E$44=\"\",\"\",Entry!$E$44))","v":""},{"$f":"IF(Entry!$H$3=\"\",\"\",IF(Entry!$G$44=\"\",\"\",Entry!$G$44))","v":""},{"$f":"IF(Entry!$H$3=\"\",\"\",IF(Entry!$I$44=\"\",\"\",Entry!$I$44))","v":""}]
[null,null,"Soil Condition",null,null,{"$f":"IF(Entry!$H$3=\"\",\"\",IF(Entry!$F$5=\"\",\"\",Entry!$F$5))","v":""}]
["Current Soil Test Levels (ppm)",null,null,"pH","N","P","K"]
[null,null,null,{"$f":"IF(Entry!$H$3=\"\",\"\",IF(AND(Entry!$O$6<>4,Entry!$O$6>0),\"error\",IF(TAMU!$A$3<>\"\",TAMU!$A$3,IF(#REF!<>\"\",#REF!,IF(#REF!<>\"\",#REF!,IF(#REF!<>\"\",#REF!,IF(#REF!<>\"\",#REF!,\"\")))))))","v":""},{"$f":"IF(Entry!$H$3=\"\",\"\",IF(AND(Entry!$O$6<>4,Entry!$O$6>0),\"error\",IF(TAMU!$B$3<>\"\",TAMU!$B$3,IF(#REF!<>\"\",#REF!,IF(#REF!<>\"\",#REF!,IF(#REF!<>\"\",#REF!,IF(#REF!<>\"\",#REF!,\"\")))))))","v":""},{"$f":"IF(Entry!$H$3=\"\",\"\",IF(AND(Entry!$O$6<>4,Entry!$O$6>0),\"error\",IF(TAMU!$C$3<>\"\",TAMU!$C$3,IF(#REF!<>\"\",#REF!,IF(#REF!<>\"\",#REF!,IF(#REF!<>\"\",#REF!,IF(#REF!<>\"\",#REF!,\"\")))))))","v":""},{"$f":"IF(Entry!$H$3=\"\",\"\",IF(AND(Entry!$O$6<>4,Entry!$O$6>0),\"error\",IF(TAMU!$D$3<>\"\",TAMU!$D$3,IF(#REF!<>\"\",#REF!,IF(#REF!<>\"\",#REF!,IF(#REF!<>\"\",#REF!,IF(#REF!<>\"\",#REF!,\"\")))))))","v":""}]
[{"$f":"IF(Specs!A6=\"manual over-ride used for year 1\", \"Manual Over-ride Used\",\"\")","v":""},null,null,"\"Approximate Texas A&M Equivalent\""]
[{"$f":"IF(Entry!$H$3=\"\",\"\",+\"YEAR 1                  (\"&Entry!$C$4&\")\")","v":""},{"$f":"IF(Entry!$H$3=\"\",\"\",\"Recommended Rates and Specifications\")","v":""},null,null,null,null,null,null,null,{"$f":"IF(Entry!$H$3=\"\",\"\",\"(# / Acre)\" )","v":""}]
[null,{"$f":"IF(Entry!$H$3=\"\",\"\",\"Crop / Grass Species And Yield\")","v":""},null,null,null,{"$f":"IF(Entry!$H$3=\"\",\"\",IF(Entry!$B$22=\"\",\"\",Entry!$B$22))","v":""},null,null,null,{"$f":"IF(Entry!$H$3=\"\",\"\",\"N\")","v":""},{"$f":"IF(Entry!$H$3=\"\",\"\",\"P2O5\")","v":""},{"$f":"IF(Entry!$H$3=\"\",\"\",\"K2O\")","v":""}]
[null,{"$f":"IF(Entry!$H$3=\"\",\"\",\"Tons Lime ( If Needed ) =\")","v":""},null,null,null,{"$f":"IF(Entry!$H$3=\"\",\"\",IF(Entry!$H$22=\"\",\"\",Entry!$H$22))","v":""},{"$f":"IF(Entry!$H$3=\"\",\"\",\"Max.NutrientsNeededToMeetYieldGoal\")","v":""},null,null,{"$f":"IF(Entry!$H$3=\"\",\"\",IF(Entry!$E$22=\"\",\"\",Entry!$E$22))","v":""},{"$f":"IF(Entry!$H$3=\"\",\"\",IF(Entry!$F$22=\"\",\"\",Entry!$F$22))","v":""},{"$f":"IF(Entry!$H$3=\"\",\"\",IF(Entry!$G$22=\"\",\"\",Entry!$G$22))","v":""}]
[null,{"$f":"IF(Entry!$H$3=\"\",\"\",\"SPECIFICATIONS ( Including Sensitive Areas )          Method, Form, Timing Of Application And Other Notes\")","v":""}]
[{"$f":"IF(Entry!$H$3=\"\",\"\",IF(Specs!$A$12=\"\",\"\",Specs!$A$12))","v":""}]

{"sheet":"Jobsheet3","index":7,"n_rows":31,"n_cols":12,"rows_kept":31,"cut":false,"hidden":false,"merged":[[22,1,22,8],[22,0,25,0],[17,0,20,0],[17,9,17,11],[22,9,22,11],[21,0,21,11],[17,1,17,8],[20,1,20,11],[19,1,19,4],[19,6,19,8],[30,0,30,11],[29,0,29,11],[28,0,28,11],[26,0,26,11],[3,9,3,11],[4,9,4,11],[14,6,14,8],[12,9,12,11],[12,1,12,8],[13,5,13,8],[18,1,18,4],[12,0,15,0],[18,5,18,8],[13,1,13,4],[16,0,16,11],[14,1,14,4],[15,1,15,11],[5,0,8,0],[5,2,5,3],[6,2,6,3],[7,2,7,3],[1,1,1,9],[3,1,3,4],[4,1,4,4],[0,2,0,5],[11,7,11,8],[7,7,7,8],[8,2,8,3],[5,7,6,8],[8,7,8,8],[9,7,9,8],[10,7,10,8],[11,3,11,6],[0,7,0,11],[5,9,6,9],[5,10,6,10],[5,11,6,11],[9,0,10,2],[25,1,25,11],[23,1,23,4],[24,1,24,4],[23,5,23,8],[24,6,24,8]]}
[null,null,null,null,null,null,null,"No Direct Entry On This Page"]
[null,"NUTRIENT MANAGEMENT JOBSHEET AND SPECIFICATIONS"]
[]
["Landuser :",{"$f":"IF(Entry!$C$5<25,\"\",IF(Entry!$C$1=\"\",\"\",Entry!$C$1))","v":"example"},null,null,null,null,null,null,"Date :",{"$f":"IF(Entry!$C$5<25,\"\",IF($B$4=\"\",\"\",TODAY()))","v":"2011-02-23"}]
["Assisted By :",{"$f":"IF(Entry!$C$5<25,\"\",IF(Entry!$C$3=\"\",\"\",Entry!$C$3))","v":""},null,null,null,null,null,null,"Field No :",{"$f":"IF(Entry!$C$5<25,\"\",IF(Entry!$C$2=\"\",\"\",Entry!$C$2))","v":"1"}]
["PURPOSE    (Mark All     That Apply)",null,"Optimum Yield",null,null,{"$f":"IF(Entry!$C$5<25,\"\",IF(Entry!$F$2=\"\",\"\",Entry!$F$2))","v":"x"},null,"Credits From Various Sources",null,"N","P2O5","K2O"]
[null,null,"Quick Cover",null,null,{"$f":"IF(Entry!$C$5<25,\"\",IF(Entry!$F$3=\"\",\"\",Entry!$F$3))","v":""}]
[null,null,"Water Quality",null,null,{"$f":"IF(Entry!$C$5<25,\"\",IF(Entry!$F$4=\"\",\"\",Entry!$F$4))","v":""},null,{"$f":"IF(Entry!$C$5<25,\"\",IF(Entry!$C$4=\"\",\"\",+\"YEAR 1        (\"&Entry!$C$4&\")\"))","v":"YEAR 1        (2007)"},null,{"$f":"IF(Entry!$C$5<25,\"\",IF(Entry!$E$44=\"\",\"\",Entry!$E$44))","v":0},{"$f":"IF(Entry!$C$5<25,\"\",IF(Entry!$G$44=\"\",\"\",Entry!$G$44))","v":0},{"$f":"IF(Entry!$C$5<25,\"\",IF(Entry!$I$44=\"\",\"\",Entry!$I$44))","v":0}]
[null,null,"Soil Condition",null,null,{"$f":"IF(Entry!$C$5<25,\"\",IF(Entry!$F$5=\"\",\"\",Entry!$F$5))","v":""},null,{"$f":"IF(Entry!$C$5<25,\"\",IF(Entry!$C$4=\"\",\"\",+\"YEAR 2        (\"&Entry!$C$4+1&\")\"))","v":"YEAR 2        (2008)"},null,{"$f":"IF(Entry!$C$5<25,\"\",IF(Entry!$E$62=\"\",\"\",Entry!$E$62))","v":0},{"$f":"IF(Entry!$C$5<25,\"\",IF(Entry!$G$62=\"\",\"\",Entry!$G$62))","v":0},{"$f":"IF(Entry!$C$5<25,\"\",IF(Entry!$I$62=\"\",\"\",Entry!$I$62))","v":0}]
["Current Soil Test Levels (ppm)",null,null,"pH","N","P","K",{"$f":"IF(Entry!$C$5<25,\"\",IF(Entry!$C$4=\"\",\"\",+\"YEAR 3        (\"&Entry!$C$4+2&\")\"))","v":"YEAR 3        (2009)"},null,{"$f":"IF(Entry!$C$5<25,\"\",IF(Entry!$E$80=\"\",\"\",Entry!$E$80))","v":0},{"$f":"IF(Entry!$C$5<25,\"\",IF(Entry!$G$80=\"\",\"\",Entry!$G$80))","v":0},{"$f":"IF(Entry!$C$5<25,\"\",IF(Entry!$I$80=\"\",\"\",Entry!$I$80))","v":0}]
[null,null,null,{"$f":"IF(Entry!$C$5<25,\"\",IF(AND(Entry!$O$6<>4,Entry!$O$6>0),\"error\",IF(TAMU!$A$3<>\"\",TAMU!$A$3,IF(#REF!<>\"\",#REF!,IF(#REF!<>\"\",#REF!,IF(#REF!<>\"\",#REF!,IF(#REF!<>\"\",#REF!,\"\")))))))","v":5.6},{"$f":"IF(Entry!$C$5<25,\"\",IF(AND(Entry!$O$6<>4,Entry!$O$6>0),\"error\",IF(TAMU!$B$3<>\"\",TAMU!$B$3,IF(#REF!<>\"\",#REF!,IF(#REF!<>\"\",#REF!,IF(#REF!<>\"\",#REF!,IF(#REF!<>\"\",#REF!,\"\")))))))","v":2},{"$f":"IF(Entry!$C$5<25,\"\",IF(AND(Entry!$O$6<>4,Entry!$O$6>0),\"error\",IF(TAMU!$C$3<>\"\",TAMU!$C$3,IF(#REF!<>\"\",#REF!,IF(#REF!<>\"\",#REF!,IF(#REF!<>\"\",#REF!,IF(#REF!<>\"\",#REF!,\"\")))))))","v":5},{"$f":"IF(Entry!$C$5<25,\"\",IF(AND(Entry!$O$6<>4,Entry!$O$6>0),\"error\",IF(TAMU!$D$3<>\"\",TAMU!$D$3,IF(#REF!<>\"\",#REF!,IF(#REF!<>\"\",#REF!,IF(#REF!<>\"\",#REF!,IF(#REF!<>\"\",#REF!,\"\")))))))","v":80},{"$f":"IF(Entry!$C$5<25,\"\",IF(Entry!$C$4=\"\",\"\",+\"YEAR 4        (\"&Entry!$C$4+3&\")\"))","v":"YEAR 4        (2010)"},null,{"$f":"IF(Entry!$C$5<25,\"\",IF(Entry!$E$98=\"\",\"\",Entry!$E$98))","v":0},{"$f":"IF(Entry!$C$5<25,\"\",IF(Entry!$G$98=\"\",\"\",Entry!$G$98))","v":0},{"$f":"IF(Entry!$C$5<25,\"\",IF(Entry!$I$98=\"\",\"\",Entry!$I$98))","v":0}]
[{"$f":"IF(Specs!A6=\"manual over-ride used for year 1\", \"Manual Over-ride Used\",\"\")","v":""},null,null,"\"Approximate Texas A&M Equivalent\"",null,null,null,{"$f":"IF(Entry!$C$5<25,\"\",IF(Entry!$C$4=\"\",\"\",+\"YEAR 5        (\"&Entry!$C$4+4&\")\"))","v":"YEAR 5        (2011)"},null,{"$f":"IF(Entry!$C$5<25,\"\",IF(Entry!$E$116=\"\",\"\",Entry!$E$116))","v":0},{"$f":"IF(Entry!$C$5<25,\"\",IF(Entry!$G$116=\"\",\"\",Entry!$G$116))","v":0},{"$f":"IF(Entry!$C$5<25,\"\",IF(Entry!$I$116=\"\",\"\",Entry!$I$116))","v":0}]
[{"$f":"IF(Entry!$C$5<25,\"\",+\"YEAR 1                  (\"&Entry!$C$4&\")\")","v":"YEAR 1                  (2007)"},{"$f":"IF(Entry!$C$5<25,\"\",\"Recommended Rates and Specifications\")","v":"Recommended Rates and Specifications"},null,null,null,null,null,null,null,{"$f":"IF(Entry!$C$5<25,\"\",\"(# / Acre)\" )","v":"(# / Acre)"}]
[null,{"$f":"IF(Entry!$C$5<25,\"\",\"Crop / Grass Species And Yield\")","v":"Crop / Grass Species And Yield"},null,null,null,{"$f":"IF(Entry!$C$5<25,\"\",IF(Entry!$B$22=\"\",\"\",Entry!$B$22))","v":"Corn 200 bu"},null,null,null,{"$f":"IF(Entry!$C$5<25,\"\",\"N\")","v":"N"},{"$f":"IF(Entry!$C$5<25,\"\",\"P2O5\")","v":"P2O5"},{"$f":"IF(Entry!$C$5<25,\"\",\"K2O\")","v":"K2O"}]
[null,{"$f":"IF(Entry!$C$5<25,\"\",\"Tons Lime ( If Needed ) =\")","v":"Tons Lime ( If Needed ) ="},null,null,null,{"$f":"IF(Entry!$C$5<25,\"\",IF(Entry!$H$22=\"\",\"\",Entry!$H$22))","v":1},{"$f":"IF(Entry!$C$5<25,\"\",\"Soil Test Recommended Nutrients For Yield Goal\")","v":"Soil Test Recommended Nutrients For Yield Goal"},null,null,{"$f":"IF(Entry!$C$5<25,\"\",IF(Entry!$E$22=\"\",\"\",Entry!$E$22))","v":245},{"$f":"IF(Entry!$C$5<25,\"\",IF(Entry!$F$22=\"\",\"\",Entry!$F$22))","v":115},{"$f":"IF(Entry!$C$5<25,\"\",IF(Entry!$G$22=\"\",\"\",Entry!$G$22))","v":120}]
[null,{"$f":"IF(Entry!$C$5<25,\"\",\"SPECIFICATIONS ( Including Sensitive Areas )          Method, Form, Timing Of Application And Other Notes\")","v":"SPECIFICATIONS ( Including Sensitive Areas )          Method, Form, Timing Of Application And Other Notes"}]
[{"$f":"IF(Entry!$C$5<25,\"\",IF(Specs!$A$12=\"\",\"\",Specs!$A$12))","v":""}]
[{"$f":"IF(Entry!$C$5<25,\"\",+\"YEAR 2                  (\"&Entry!$C$4+1&\")\")","v":"YEAR 2                  (2008)"},{"$f":"IF(Entry!$C$5<25,\"\",\"Recommended Rates and Specifications\")","v":"Recommended Rates and Specifications"},null,null,null,null,null,null,null,{"$f":"IF(Entry!$C$5<25,\"\",\"(# / Acre) 1/\")","v":"(# / Acre) 1/"}]
[null,{"$f":"IF(Entry!$C$5<25,\"\",\"Crop / Grass Species And Yield\")","v":"Crop / Grass Species And Yield"},null,null,null,{"$f":"IF(Entry!$C$5<25,\"\",IF(Entry!$B$23=\"\",\"\",Entry!$B$23))","v":"Corn 100 bu"},null,null,null,{"$f":"IF(Entry!$C$5<25,\"\",\"N\")","v":"N"},{"$f":"IF(Entry!$C$5<25,\"\",\"P2O5\")","v":"P2O5"},{"$f":"IF(Entry!$C$5<25,\"\",\"K2O\")","v":"K2O"}]
[null,{"$f":"IF(Entry!$C$5<25,\"\",\"Tons Lime ( If Needed ) =\")","v":"Tons Lime ( If Needed ) ="},null,null,null,{"$f":"IF(Entry!$C$5<25,\"\",IF(Entry!$H$23=\"\",\"\",Entry!$H$23))","v":""},{"$f":"IF(Entry!$C$5<25,\"\",\"Max. Nutrients To Meet Crop Requirement\")","v":"Max. Nutrients To Meet Crop Requirement"},null,null,{"$f":"IF(Entry!$C$5<25,\"\",IF(Entry!$E$23=\"\",\"\",Entry!$E$23))","v":120},{"$f":"IF(Entry!$C$5<25,\"\",IF(Entry!$F$23=\"\",\"\",Entry!$F$23))","v":80},{"$f":"IF(Entry!$C$5<25,\"\",IF(Entry!$G$23=\"\",\"\",Entry!$G$23))","v":110}]
[null,{"$f":"IF(Entry!$C$5<25,\"\",\"SPECIFICATIONS ( Including Sensitive Areas )          Method, Form, Timing Of Application And Other Notes\")","v":"SPECIFICATIONS ( Including Sensitive Areas )          Method, Form, Timing Of Application And Other Notes"}]
[{"$f":"IF(Entry!$C$5<25,\"\",IF(Specs!$A$34=\"\",\"\",Specs!$A$34))","v":""}]
[{"$f":"IF(Entry!$C$5<25,\"\",+\"YEAR 3                  (\"&Entry!$C$4+2&\")\")","v":"YEAR 3                  (2009)"},{"$f":"IF(Entry!$C$5<25,\"\",\"Recommended Rates and Specifications\")","v":"Recommended Rates and Specifications"},null,null,null,null,null,null,null,{"$f":"IF(Entry!$C$5<25,\"\",\"(# / Acre) 1/\")","v":"(# / Acre) 1/"}]
[null,{"$f":"IF(Entry!$C$5<25,\"\",\"Crop / Grass Species And Yield\")","v":"Crop / Grass Species And Yield"},null,null,null,{"$f":"IF(Entry!$C$5<25,\"\",IF(Entry!$B$24=\"\",\"\",Entry!$B$24))","v":"Bermudagrass, Hyb, Hay  12000 lb"},null,null,null,{"$f":"IF(Entry!$C$5<25,\"\",\"N\")","v":"N"},{"$f":"IF(Entry!$C$5<25,\"\",\"P2O5\")","v":"P2O5"},{"$f":"IF(Entry!$C$5<25,\"\",\"K2O\")","v":"K2O"}]
[null,{"$f":"IF(Entry!$C$5<25,\"\",\"Tons Lime ( If Needed ) =\")","v":"Tons Lime ( If Needed ) ="},null,null,null,{"$f":"IF(Entry!$C$5<25,\"\",IF(Entry!$H$24=\"\",\"\",Entry!$H$24))","v":""},{"$f":"IF(Entry!$C$5<25,\"\",\"Max. Nutrients Needed To Meet Crop Requirement\")","v":"Max. Nutrients Needed To Meet Crop Requirement"},null,null,{"$f":"IF(Entry!$C$5<25,\"\",IF(Entry!$E$24=\"\",\"\",Entry!$E$24))","v":300},{"$f":"IF(Entry!$C$5<25,\"\",IF(Entry!$F$24=\"\",\"\",Entry!$F$24))","v":140},{"$f":"IF(Entry!$C$5<25,\"\",IF(Entry!$G$24=\"\",\"\",Entry!$G$24))","v":250}]
[null,{"$f":"IF(Entry!$C$5<25,\"\",\"SPECIFICATIONS ( Including Sensitive Areas )          Method, Form, Timing Of Application And Other Notes\")","v":"SPECIFICATIONS ( Including Sensitive Areas )          Method, Form, Timing Of Application And Other Notes"}]
[{"$f":"IF(Entry!$C$5<25,\"\",IF(Specs!$A$56=\"\",\"\",Specs!$A$56))","v":""}]
["N and P2O5 rates will not exceed recommended rates by more than 10%"]
["1/   For Year 2 and beyond, when no new soil tests are obtained and nutrient budgets are used:"]
["N is based on Crop Requirement; P2O5 is be based on Crop Requirement if previous years soil test rating is not > H;                                                                                                                                                                                                                                "]
["K2O is based on Crop Requirement if previous years soil test rating is not > H."]

{"sheet":"Jobsheet5","index":8,"n_rows":41,"n_cols":12,"rows_kept":41,"cut":false,"hidden":false,"merged":[[0,2,0,5],[11,7,11,8],[7,7,7,8],[25,1,25,11],[23,1,23,4],[24,1,24,4],[23,5,23,8],[24,6,24,8],[12,1,12,8],[13,5,13,8],[8,7,8,8],[9,7,9,8],[10,7,10,8],[9,0,10,2],[5,0,8,0],[5,2,5,3],[6,2,6,3],[7,2,7,3],[8,2,8,3],[5,7,6,8],[18,5,18,8],[13,1,13,4],[16,0,16,11],[19,1,19,4],[19,6,19,8],[14,1,14,4],[1,1,1,9],[3,1,3,4],[4,1,4,4],[5,9,6,9],[5,10,6,10],[5,11,6,11],[40,0,40,11],[33,5,33,8],[38,0,38,11],[39,0,39,11],[35,1,35,11],[3,9,3,11],[4,9,4,11],[22,9,22,11],[21,0,21,11],[20,1,20,11],[36,0,36,11],[37,0,37,11],[0,7,0,11],[26,0,26,11],[34,6,34,8],[22,1,22,8],[22,0,25,0],[17,0,20,0],[12,9,12,11],[15,1,15,11],[17,9,17,11],[28,1,28,4],[29,1,29,4],[28,5,28,8],[11,3,11,6],[27,0,30,0],[18,1,18,4],[14,6,14,8],[17,1,17,8],[12,0,15,0],[31,0,31,11],[32,0,35,0],[32,1,32,8],[32,9,32,11],[27,9,27,11],[27,1,27,8],[30,1,30,11],[29,6,29,8],[33,1,33,4],[34,1,34,4]]}
[null,null,null,null,null,null,null,"No Direct Entry On This Page"]
[null,"NUTRIENT MANAGEMENT JOBSHEET AND SPECIFICATIONS"]
[]
["Landuser :",{"$f":"IF(Entry!$C$5>=25,\"\",IF(Entry!$C$1=\"\",\"\",Entry!$C$1))","v":""},null,null,null,null,null,null,"Date :",{"$f":"IF(Entry!$C$5>=25,\"\",IF($B$4=\"\",\"\",TODAY()))","v":""}]
["Assisted By :",{"$f":"IF(Entry!$C$5>=25,\"\",IF(Entry!$C$3=\"\",\"\",Entry!$C$3))","v":""},null,null,null,null,null,null,"Field No :",{"$f":"IF(Entry!$C$5>=25,\"\",IF(Entry!$C$2=\"\",\"\",Entry!$C$2))","v":""}]
["PURPOSE    (Mark All     That Apply)",null,"Optimum Yield",null,null,{"$f":"IF(Entry!$C$5>=25,\"\",IF(Entry!$F$2=\"\",\"\",Entry!$F$2))","v":""},null,"Credits From Various Sources",null,"N","P2O5","K2O"]
[null,null,"Quick Cover",null,null,{"$f":"IF(Entry!$C$5>=25,\"\",IF(Entry!$F$3=\"\",\"\",Entry!$F$3))","v":""}]
[null,null,"Water Quality",null,null,{"$f":"IF(Entry!$C$5>=25,\"\",IF(Entry!$F$4=\"\",\"\",Entry!$F$4))","v":""},null,{"$f":"IF(Entry!$C$5>=25,\"\",IF(Entry!$C$4=\"\",\"\",+\"YEAR 1        (\"&Entry!$C$4&\")\"))","v":""},null,{"$f":"IF(Entry!$C$5>=25,\"\",IF(Entry!$E$44=\"\",\"\",Entry!$E$44))","v":""},{"$f":"IF(Entry!$C$5>=25,\"\",IF(Entry!$G$44=\"\",\"\",Entry!$G$44))","v":""},{"$f":"IF(Entry!$C$5>=25,\"\",IF(Entry!$I$44=\"\",\"\",Entry!$I$44))","v":""}]
[null,null,"Soil Condition",null,null,{"$f":"IF(Entry!$C$5>=25,\"\",IF(Entry!$F$5=\"\",\"\",Entry!$F$5))","v":""},null,{"$f":"IF(Entry!$C$5>=25,\"\",IF(Entry!$C$4=\"\",\"\",+\"YEAR 2        (\"&Entry!$C$4+1&\")\"))","v":""},null,{"$f":"IF(Entry!$C$5>=25,\"\",IF(Entry!$E$62=\"\",\"\",Entry!$E$62))","v":""},{"$f":"IF(Entry!$C$5>=25,\"\",IF(Entry!$G$62=\"\",\"\",Entry!$G$62))","v":""},{"$f":"IF(Entry!$C$5>=25,\"\",IF(Entry!$I$62=\"\",\"\",Entry!$I$62))","v":""}]
["Current Soil Test Levels (ppm)",null,null,"pH","N","P","K",{"$f":"IF(Entry!$C$5>=25,\"\",IF(Entry!$C$4=\"\",\"\",+\"YEAR 3        (\"&Entry!$C$4+2&\")\"))","v":""},null,{"$f":"IF(Entry!$C$5>=25,\"\",IF(Entry!$E$80=\"\",\"\",Entry!$E$80))","v":""},{"$f":"IF(Entry!$C$5>=25,\"\",IF(Entry!$G$80=\"\",\"\",Entry!$G$80))","v":""},{"$f":"IF(Entry!$C$5>=25,\"\",IF(Entry!$I$80=\"\",\"\",Entry!$I$80))","v":""}]
[null,null,null,{"$f":"IF(Entry!$C$5>=25,\"\",IF(AND(Entry!$O$6<>4,Entry!$O$6>0),\"error\",IF(TAMU!$A$3<>\"\",TAMU!$A$3,IF(#REF!<>\"\",#REF!,IF(#REF!<>\"\",#REF!,IF(#REF!<>\"\",#REF!,IF(#REF!<>\"\",#REF!,\"\")))))))","v":""},{"$f":"IF(Entry!$C$5>=25,\"\",IF(AND(Entry!$O$6<>4,Entry!$O$6>0),\"error\",IF(TAMU!$B$3<>\"\",TAMU!$B$3,IF(#REF!<>\"\",#REF!,IF(#REF!<>\"\",#REF!,IF(#REF!<>\"\",#REF!,IF(#REF!<>\"\",#REF!,\"\")))))))","v":""},{"$f":"IF(Entry!$C$5>=25,\"\",IF(AND(Entry!$O$6<>4,Entry!$O$6>0),\"error\",IF(TAMU!$C$3<>\"\",TAMU!$C$3,IF(#REF!<>\"\",#REF!,IF(#REF!<>\"\",#REF!,IF(#REF!<>\"\",#REF!,IF(#REF!<>\"\",#REF!,\"\")))))))","v":""},{"$f":"IF(Entry!$C$5>=25,\"\",IF(AND(Entry!$O$6<>4,Entry!$O$6>0),\"error\",IF(TAMU!$D$3<>\"\",TAMU!$D$3,IF(#REF!<>\"\",#REF!,IF(#REF!<>\"\",#REF!,IF(#REF!<>\"\",#REF!,IF(#REF!<>\"\",#REF!,\"\")))))))","v":""},{"$f":"IF(Entry!$C$5>=25,\"\",IF(Entry!$C$4=\"\",\"\",+\"YEAR 4        (\"&Entry!$C$4+3&\")\"))","v":""},null,{"$f":"IF(Entry!$C$5>=25,\"\",IF(Entry!$E$98=\"\",\"\",Entry!$E$98))","v":""},{"$f":"IF(Entry!$C$5>=25,\"\",IF(Entry!$G$98=\"\",\"\",Entry!$G$98))","v":""},{"$f":"IF(Entry!$C$5>=25,\"\",IF(Entry!$I$98=\"\",\"\",Entry!$I$98))","v":""}]
[null,null,null,"\"Approximate Texas A&M Equivalent\"",null,null,null,{"$f":"IF(Entry!$C$5>=25,\"\",IF(Entry!$C$4=\"\",\"\",+\"YEAR 5        (\"&Entry!$C$4+4&\")\"))","v":""},null,{"$f":"IF(Entry!$C$5>=25,\"\",IF(Entry!$E$116=\"\",\"\",Entry!$E$116))","v":""},{"$f":"IF(Entry!$C$5>=25,\"\",IF(Entry!$G$116=\"\",\"\",Entry!$G$116))","v":""},{"$f":"IF(Entry!$C$5>=25,\"\",IF(Entry!$I$116=\"\",\"\",Entry!$I$116))","v":""}]
[{"$f":"IF(Entry!$C$5>=25,\"\",+\"YEAR 1                  (\"&Entry!$C$4&\")\")","v":""},{"$f":"IF(Entry!$C$5>=25,\"\",\"Recommended Rates and Specifications\")","v":""},null,null,null,null,null,null,null,{"$f":"IF(Entry!$C$5>=25,\"\",\"(# / Acre)\")","v":""}]
[null,{"$f":"IF(Entry!$C$5>=25,\"\",\"Crop / Grass Species And Yield\")","v":""},null,null,null,{"$f":"IF(Entry!$C$5>=25,\"\",IF(Entry!$B$22=\"\",\"\",Entry!$B$22))","v":""},null,null,null,{"$f":"IF(Entry!$C$5>=25,\"\",\"N\")","v":""},{"$f":"IF(Entry!$C$5>=25,\"\",\"P2O5\")","v":""},{"$f":"IF(Entry!$C$5>=25,\"\",\"K2O\")","v":""}]
[null,{"$f":"IF(Entry!$C$5>=25,\"\",\"Tons Lime ( If Needed ) =\")","v":""},null,null,null,{"$f":"IF(Entry!$C$5>=25,\"\",IF(Entry!$H$22=\"\",\"\",Entry!$H$22))","v":""},{"$f":"IF(Entry!$C$5>=25,\"\",\"Max. Nutrients Needed To Meet Yield Goal\")","v":""},null,null,{"$f":"IF(Entry!$C$5>=25,\"\",IF(Entry!$E$22=\"\",\"\",Entry!$E$22))","v":""},{"$f":"IF(Entry!$C$5>=25,\"\",IF(Entry!$F$22=\"\",\"\",Entry!$F$22))","v":""},{"$f":"IF(Entry!$C$5>=25,\"\",IF(Entry!$G$22=\"\",\"\",Entry!$G$22))","v":""}]
[null,{"$f":"IF(Entry!$C$5>=25,\"\",\"SPECIFICATIONS ( Including Sensitive Areas )          Method, Form, Timing Of Application And Other Notes\")","v":""}]
[{"$f":"IF(Entry!$C$5>=25,\"\",IF(Specs!$A$12=\"\",\"\",Specs!$A$12))","v":""}]
[{"$f":"IF(Entry!$C$5>=25,\"\",+\"YEAR 2                  (\"&Entry!$C$4+1&\")\")","v":""},{"$f":"IF(Entry!$C$5>=25,\"\",\"Recommended Rates and Specifications\")","v":""},null,null,null,null,null,null,null,{"$f":"IF(Entry!$C$5>=25,\"\",\"(# / Acre)\")","v":""}]
[null,{"$f":"IF(Entry!$C$5>=25,\"\",\"Crop / Grass Species And Yield\")","v":""},null,null,null,{"$f":"IF(Entry!$C$5>=25,\"\",IF(Entry!$B$23=\"\",\"\",Entry!$B$23))","v":""},null,null,null,{"$f":"IF(Entry!$C$5>=25,\"\",\"N\")","v":""},{"$f":"IF(Entry!$C$5>=25,\"\",\"P2O5\")","v":""},{"$f":"IF(Entry!$C$5>=25,\"\",\"K2O\")","v":""}]
[null,{"$f":"IF(Entry!$C$5>=25,\"\",\"Tons Lime ( If Needed ) =\")","v":""},null,null,null,{"$f":"IF(Entry!$C$5>=25,\"\",IF(Entry!$H$23=\"\",\"\",Entry!$H$23))","v":""},{"$f":"IF(Entry!$C$5>=25,\"\",\"Max. Nutrients Needed To Meet Yield Goal\")","v":""},null,null,{"$f":"IF(Entry!$C$5>=25,\"\",IF(Entry!$E$23=\"\",\"\",Entry!$E$23))","v":""},{"$f":"IF(Entry!$C$5>=25,\"\",IF(Entry!$F$23=\"\",\"\",Entry!$F$23))","v":""},{"$f":"IF(Entry!$C$5>=25,\"\",IF(Entry!$G$23=\"\",\"\",Entry!$G$23))","v":""}]
[null,{"$f":"IF(Entry!$C$5>=25,\"\",\"SPECIFICATIONS ( Including Sensitive Areas )          Method, Form, Timing Of Application And Other Notes\")","v":""}]
[{"$f":"IF(Entry!$C$5>=25,\"\",IF(Specs!$A$34=\"\",\"\",Specs!$A$34))","v":""}]
[{"$f":"IF(Entry!$C$5>=25,\"\",+\"YEAR 3                  (\"&Entry!$C$4+2&\")\")","v":""},{"$f":"IF(Entry!$C$5>=25,\"\",\"Recommended Rates and Specifications\")","v":""},null,null,null,null,null,null,null,{"$f":"IF(Entry!$C$5>=25,\"\",\"(# / Acre)\")","v":""}]
[null,{"$f":"IF(Entry!$C$5>=25,\"\",\"Crop / Grass Species And Yield\")","v":""},null,null,null,{"$f":"IF(Entry!$C$5>=25,\"\",IF(Entry!$B$24=\"\",\"\",Entry!$B$24))","v":""},null,null,null,{"$f":"IF(Entry!$C$5>=25,\"\",\"N\")","v":""},{"$f":"IF(Entry!$C$5>=25,\"\",\"P2O5\")","v":""},{"$f":"IF(Entry!$C$5>=25,\"\",\"K2O\")","v":""}]
[null,{"$f":"IF(Entry!$C$5>=25,\"\",\"Tons Lime ( If Needed ) =\")","v":""},null,null,null,{"$f":"IF(Entry!$C$5>=25,\"\",IF(Entry!$H$24=\"\",\"\",Entry!$H$24))","v":""},{"$f":"IF(Entry!$C$5>=25,\"\",\"Max. Nutrients Needed To Meet Yield Goal\")","v":""},null,null,{"$f":"IF(Entry!$C$5>=25,\"\",IF(Entry!$E$24=\"\",\"\",Entry!$E$24))","v":""},{"$f":"IF(Entry!$C$5>=25,\"\",IF(Entry!$F$24=\"\",\"\",Entry!$F$24))","v":""},{"$f":"IF(Entry!$C$5>=25,\"\",IF(Entry!$G$24=\"\",\"\",Entry!$G$24))","v":""}]
[null,{"$f":"IF(Entry!$C$5>=25,\"\",\"SPECIFICATIONS ( Including Sensitive Areas )          Method, Form, Timing Of Application And Other Notes\")","v":""}]
[{"$f":"IF(Entry!$C$5>=25,\"\",IF(Specs!$A$56=\"\",\"\",Specs!$A$56))","v":""}]
[{"$f":"IF(Entry!$C$5>=25,\"\", +\"YEAR 4                  (\"&Entry!$C$4+3&\")\")","v":""},{"$f":"IF(Entry!$C$5>=25,\"\",\"Recommended Rates and Specifications\")","v":""},null,null,null,null,null,null,null,{"$f":"IF(Entry!$C$5>=25,\"\",\"(# / Acre)\")","v":""}]
[null,{"$f":"IF(Entry!$C$5>=25,\"\",\"Crop / Grass Species And Yield\")","v":""},null,null,null,{"$f":"IF(Entry!$C$5>=25,\"\",IF(Entry!$B$25=\"\",\"\",Entry!$B$25))","v":""},null,null,null,{"$f":"IF(Entry!$C$5>=25,\"\",\"N\")","v":""},{"$f":"IF(Entry!$C$5>=25,\"\",\"P2O5\")","v":""},{"$f":"IF(Entry!$C$5>=25,\"\",\"K2O\")","v":""}]
[null,{"$f":"IF(Entry!$C$5>=25,\"\",\"Tons Lime ( If Needed ) =\")","v":""},null,null,null,{"$f":"IF(Entry!$C$5>=25,\"\",IF(Entry!$H$25=\"\",\"\",Entry!$H$25))","v":""},{"$f":"IF(Entry!$C$5>=25,\"\",\"Max. Nutrients Needed To Meet Yield Goal\")","v":""},null,null,{"$f":"IF(Entry!$C$5>=25,\"\",IF(Entry!$E$25=\"\",\"\",Entry!$E$25))","v":""},{"$f":"IF(Entry!$C$5>=25,\"\",IF(Entry!$F$25=\"\",\"\",Entry!$F$25))","v":""},{"$f":"IF(Entry!$C$5>=25,\"\",IF(Entry!$G$25=\"\",\"\",Entry!$G$25))","v":""}]
[null,{"$f":"IF(Entry!$C$5>=25,\"\",\"SPECIFICATIONS ( Including Sensitive Areas )          Method, Form, Timing Of Application And Other Notes\")","v":""}]
[{"$f":"IF(Entry!$C$5>=25,\"\",IF(Specs!$A$78=\"\",\"\",Specs!$A$78))","v":""}]
[{"$f":"IF(Entry!$C$5>=25,\"\",+\"YEAR 5                  (\"&Entry!$C$4+5&\")\")","v":""},{"$f":"IF(Entry!$C$5>=25,\"\",\"Recommended Rates and Specifications\")","v":""},null,null,null,null,null,null,null,{"$f":"IF(Entry!$C$5>=25,\"\",\"(# / Acre)\")","v":""}]
[null,{"$f":"IF(Entry!$C$5>=25,\"\",\"Crop / Grass Species And Yield\")","v":""},null,null,null,{"$f":"IF(Entry!$C$5>=25,\"\",IF(Entry!$B$26=\"\",\"\",Entry!$B$26))","v":""},null,null,null,{"$f":"IF(Entry!$C$5>=25,\"\",\"N\")","v":""},{"$f":"IF(Entry!$C$5>=25,\"\",\"P2O5\")","v":""},{"$f":"IF(Entry!$C$5>=25,\"\",\"K2O\")","v":""}]
[null,{"$f":"IF(Entry!$C$5>=25,\"\",\"Tons Lime ( If Needed ) =\")","v":""},null,null,null,{"$f":"IF(Entry!$C$5>=25,\"\",IF(Entry!$H$26=\"\",\"\",Entry!$H$26))","v":""},{"$f":"IF(Entry!$C$5>=25,\"\",\"Max. Nutrients Needed To Meet Yield Goal\")","v":""},null,null,{"$f":"IF(Entry!$C$5>=25,\"\",IF(Entry!$E$26=\"\",\"\",Entry!$E$26))","v":""},{"$f":"IF(Entry!$C$5>=25,\"\",IF(Entry!$F$26=\"\",\"\",Entry!$F$26))","v":""},{"$f":"IF(Entry!$C$5>=25,\"\",IF(Entry!$G$26=\"\",\"\",Entry!$G$26))","v":""}]
[null,{"$f":"IF(Entry!$C$5>=25,\"\",\"SPECIFICATIONS ( Including Sensitive Areas )          Method, Form, Timing Of Application And Other Notes\")","v":""}]
[{"$f":"IF(Entry!$C$5>=25,\"\",IF(Specs!$A$100=\"\",\"\",Specs!$A$100))","v":""}]
["1/   For Year 2 and beyond, when no new soil tests are obtained and nutrient budgets are used:"]
["N is based on Crop Requirement.                                                                                                                                                                                                                                "]
["P2O5 is be based on Crop Requirement if previous years soil test rating is not > H."]
["K2O is based on Crop Requirement if previous years soil test rating is not > H"]

{"sheet":"O&M","index":9,"n_rows":61,"n_cols":7,"rows_kept":61,"cut":false,"hidden":false,"merged":[[9,1,9,6],[0,4,0,6],[4,1,4,4],[14,1,14,6],[16,1,16,6],[12,1,12,6],[10,1,10,6],[11,1,11,6],[2,1,2,6],[3,1,3,6],[5,1,5,6],[20,1,20,6],[17,1,17,6],[18,1,18,6],[19,1,19,6],[13,1,13,6],[1,2,1,3],[1,5,1,6],[7,1,7,6],[8,1,8,6],[6,1,6,4]]}
[null,null,null,null,"No Direct Entry On This Page"]
[null,"Landuser:",{"$f":"IF(Entry!$C$1=\"\",\"\",Entry!$C$1)","v":"example"},null,"Field:  ",{"$f":"IF(Entry!$C$2=\"\",\"\",Entry!$C$2)","v":"1"}]
[null,"Operations and Maintenance"]
[null,"The producer should review this plan annually.  In addition, this plan should be reviewed with and revised by a Certified Nutrient Management Specialist immediately after new soil tests and recommendations have been obtained.  "]
[null,"At a minimum, all fields with inorganic nutrients applied will have a soil test every",null,null,null,{"$f":"IF(Entry!$C$5>=25,\"3 years.\",\"5 years.\")","v":"3 years."},"In areas where animal"]
[null,"wastes are applied, a soil test is required every other year.  STATE REGULATIONS TAKES PRECEDENCE OVER THESE GUIDELINES WHERE APPLICABLE.  Additional soil tests should be considered after years of extremely high or low"]
[null,"production (+/- 30% of the realistic yield goal).  Normal rainfall for this county is: ",null,null,null,{"$f":"Entry!$C$5&\" inches\"","v":"45 inches"}]
[null,"Sampling depths will be 0-6 inches unless nutrients are injected, knifed in, or otherwise placed below the surface in which case the sampling depth will be between 3-9 inches.  Soil sampling and collection should be in accordance to guidance provided by the Texas Cooperative Extension (TCE)."]
[null,"Pre-plant nitrogen application will not precede the normal planting date of the planned crop by more than 120 days, if the nitrogen is incorporated within 24 hours after application, or 30 days prior to planting if not incorporated within 24 hours.  Total nitrogen and phosphorus applied will not exceed the crop requirement for the planned realistic yield goal."]
[null,"Erosion will be controlled on fields where nutrients are to be applied."]
[null,"This plan should be revised when:"]
[null,"the crop rotation or crop sequence changes."]
[null,"a change in farming operation occurs."]
[null,"new soil test analyses and new recommendations are received."]
[null,"new or different technology becomes available."]
[null,"Note: If this plan is part of a contract all changes must be approved prior to application of nutrients."]
[null,"Calibrate application equipment to apply within +/- 10% of the recommended rate to achieve uniform distribution.  When anhydrous ammonia is used, make sure that loose soil and proper moisture conditions are available to insure proper furrow closure.  Packer wheels and/or other devices may be necessary."]
[null,"Handle all nutrient material with caution.  Wear appropriate protective clothing.  Extra caution should be taken to avoid eye contact or exposure to ammonia fumes.  Follow all label directions where available."]
[null,"Clean residual materials from equipment and dispose properly.  When flushing equipment, keep wastewater away from water bodies such as ponds, streams and wells.  The residual may be saved and utilized as part of the overall fertilizatiion program."]
[]
[null,"Nutrient Management - (Optional Field Sketch including sensitive areas)"]
[]
[]
[]
[]
[]
[]
[]
[]
[]
[]
[]
[]
[]
[]
[]
[]
[]
[]
[]
[]
[]
[]
[]
[]
[]
[]
[]
[]
[]
[]
[null,"Plan Prepared by:",null,null,"Date:"]
[]
[]
[null,"Plan Approved by:",null,null,"Date:"]
[]
[]
[null,"Producer Signature:",null,null,"Date:"]
[]
[null,"The producer's signature indicates that this plan has been discussed with him/her.  "]
[null,"If this plan is not signed, indicate how the plan was provided to the producer (via phone, mail, or other means)."]

{"sheet":"TAMU","index":10,"n_rows":5,"n_cols":4,"rows_kept":5,"cut":false,"hidden":false,"merged":[[0,0,0,6],[3,0,3,6]]}
["A & M Test Results (ppm)"]
["pH","Nitrogen","Phosphorus","Potassium"]
[5.6,2,5,80]
[]
[null,null,{"$f":"IF(C3=\"\",\"\",IF(C3<='A&M'!E4,\"Very Low\",IF(AND(C3>='A&M'!F4,C3<='A&M'!G4),\"Low\",IF(AND(C3>='A&M'!H4,C3<='A&M'!I4),\"Medium\",IF(AND(C3>='A&M'!J4,C3<='A&M'!K4),\"High\",IF(AND(C3>='A&M'!L4,C3<='A&M'!M4),\"Very High\",\"Excessive\"))))))","v":"Very Low"}]

{"sheet":"EX_Soil_Test","index":11,"n_rows":363,"n_cols":38,"rows_kept":363,"cut":false,"hidden":false,"merged":[[0,0,0,2],[2,0,2,2],[0,4,2,11],[11,2,11,11],[10,2,10,11],[4,5,4,9],[4,0,4,2],[5,0,5,2],[6,0,6,2],[7,0,7,2],[14,5,14,10],[49,24,51,24],[49,25,51,25],[8,2,8,5],[9,2,9,11],[30,0,49,12],[49,26,51,26],[49,16,51,16],[49,17,51,17],[49,15,51,15],[49,18,51,18],[49,19,51,19],[49,20,51,20],[49,21,51,21],[49,22,51,22],[49,23,51,23]]}
["Example soil lab",null,null,null,"This sheet is for demonstration purposes only and is not intended to provide the same results as Texas A&M University Soil Lab"]
["Anywhere, USA"]
[]
["Report generated for:"]
[{"$f":"Entry!C1","v":"example"},null,null,null,null,"Soil Test Results"]
[{"$f":"Entry!C2","v":"1"},null,null,null,null,"Mehlich III by ICP used for this analysis.",null,null,null,null,null,null,null,null,"Coarse"]
["Coarse",null,null,"Soil Textural Group",null,null,null,null,null,null,null,null,null,null,"Medium"]
[null,null,null,"County",null,null,null,null,null,null,null,null,null,null,"Fine"]
["Laboratory Number:"]
["Customer Sample ID:"]
[null,"Crop Grown:",{"$f":"Entry!B22","v":"Corn 200 bu"},null,null,null,null,null,null,null,null,null,"Generated",null,null,{"$f":"VLOOKUP(C11,all_crops,12)","v":"g"}]
[null,"Crop Grown:",null,null,null,null,null,null,null,null,null,null,"Entered"]
[]
["Analysis",null,"Results","CL*","Units","VLow","Low","Mod","High","VHigh","Excess"]
["pH",null,{"$f":"TAMU!A3","v":5.6},5.8,"--",{"$f":"O15","v":"Moderately Acid"},null,null,null,null,null,"Fertilizer Recommendation",null,null,{"$f":"IF(C15=\"\",\"\",IF(C15<=5,\"Very Strongly Acid\",IF(AND(C15>=5.1,C15<=5.5),\"Strongly Acid\",IF(AND(C15>=5.6,C15<=6),\"Moderately Acid\",IF(AND(C15>=6.1,C15<=6.5),\"Slightly Acid\",IF(AND(C15>=6.6,C15<=7.3),\"Neutral\",\"Alkaline\"))))))","v":"Moderately Acid"}]
["Conductivity",null,35,"--","umho/cm"]
["Nitrate-N",null,{"$f":"TAMU!B3","v":2},"--","ppm",{"$f":"IF(O17=\"very low\",\"********\",IF(O17=\"low\",\"****************\",IF(O17=\"medium\",\"*************************\",IF(O17=\"high\",\"***********************************\",IF(O17=\"very high\",\"********************************************\",IF(O17=\"excessive\",\"*******************************************************\",\"\"))))))","v":"********"},null,null,null,null,null,null,{"$f":"Entry!E22","v":245},"lbs N/acre",{"$f":"IF(C17=\"\",\"\",IF(C17<=10,\"Very Low\",IF(AND(C17>=11,C17<=15),\"Low\",IF(AND(C17>=16,C17<=20),\"Medium\",IF(AND(C17>=21,C17<=30),\"High\",IF(AND(C17>=31,C17<=40),\"Very High\",\"Excessive\"))))))","v":"Very Low"}]
["Phosphorus",null,{"$f":"TAMU!C3","v":5},{"$f":"CEILING(ROUND(VLOOKUP(C11,all_crops,6)/(VLOOKUP(C11,all_crops,7)),0),5)","v":50},"ppm",{"$f":"IF(O18=\"very low\",\"********\",IF(O18=\"low\",\"****************\",IF(O18=\"medium\",\"*************************\",IF(O18=\"high\",\"***********************************\",IF(O18=\"very high\",\"********************************************\",IF(O18=\"excessive\",\"*******************************************************\",\"\"))))))","v":"*************************"},null,null,null,null,null,null,{"$f":"Entry!F22","v":115},"lbs P2O5/acre","Medium"]
["Potassium",null,{"$f":"TAMU!D3","v":80},{"$f":"CEILING(ROUND(VLOOKUP(C11,all_crops,9)/(VLOOKUP(C11,all_crops,10)),0),5)","v":135},"ppm","***********************************",null,null,null,null,null,null,{"$f":"Entry!G22","v":120},"lbs K2O/acre",{"$f":"IF(C19=\"\",\"\",IF(C19<=24,\"Very Low\",IF(AND(C19>=25,C19<=49),\"Low\",IF(AND(C19>=50,C19<=74),\"Medium\",IF(AND(C19>=75,C19<=124),\"High\",IF(AND(C19>=125,C19<=300),\"Very High\",\"Excessive\"))))))","v":"High"}]
["Calcium",null,500,null,"ppm","*******************************************************",null,null,null,null,null,null,null,"lbs Ca/acre",{"$f":"IF(C20=\"\",\"\",IF(C20<=74,\"Very Low\",IF(AND(C20>=75,C20<=109),\"Low\",IF(AND(C20>=110,C20<=129),\"Medium\",IF(AND(C20>=130,C20<=179),\"High\",IF(AND(C20>=180,C20<=300),\"Very High\",\"Excessive\"))))))","v":"Excessive"}]
["Magnesium",null,19,null,"ppm","****************",null,null,null,null,null,null,null,"lbs Mg/acre",{"$f":"IF(C21=\"\",\"\",IF(C21<=9,\"Very Low\",IF(AND(C21>=10,C21<=19),\"Low\",IF(AND(C21>=20,C21<=29),\"Medium\",IF(AND(C21>=30,C21<=49),\"High\",IF(AND(C21>=50,C21<=75),\"Very High\",\"Excessive\"))))))","v":"Low"}]
["Sulfur",null,22,null,"ppm","********************************************",null,null,null,null,null,null,null,"lbs S/acre",{"$f":"IF(C22=\"\",\"\",IF(C22<=1,\"Very Low\",IF(AND(C22>=2,C22<=4),\"Low\",IF(AND(C22>=5,C22<=9),\"Medium\",IF(AND(C22>=10,C22<=12),\"High\",IF(AND(C22>=13,C22<=25),\"Very High\",\"Excessive\"))))))","v":"Very High"}]
["Sodium",null,160,null,"ppm","*************************",null,null,null,null,null,null,null,null,{"$f":"IF(C23=\"\",\"\",IF(C23<=49,\"Very Low\",IF(AND(C23>=50,C23<=129),\"Low\",IF(AND(C23>=130,C23<=249),\"Medium\",IF(AND(C23>=250,C23<=499),\"High\",IF(AND(C23>=500,C23<=1000),\"Very High\",\"Excessive\"))))))","v":"Medium"}]
["Iron"]
["Zinc"]
["Manganese"]
["Copper"]
["Boron"]
["Limestone Requirement",null,null,null,null,null,null,null,null,null,null,{"$f":"P29","v":1},"tons 100ECCE/acre",null,null,{"$f":"IF(AND(A7=\"Coarse\",P11=\"L\"),VLOOKUP(C15,ph_table,5,TRUE),IF(AND(A7=\"medium\",P11=\"L\"),VLOOKUP(C15,ph_table,6,TRUE),IF(AND(A7=\"fine\",P11=\"L\"),VLOOKUP(C15,ph_table,7,TRUE),IF(AND(A7=\"Coarse\",P11<>\"L\"),VLOOKUP(C15,ph_table,2,TRUE),IF(AND(A7=\"medium\",P11<>\"L\"),VLOOKUP(C15,ph_table,3,TRUE),IF(AND(A7=\"fine\",P11<>\"L\"),VLOOKUP(C15,ph_table,4,TRUE),\"\"))))))","v":1}]
["Additional Notes:"]
[]
[]
[]
[]
[]
[]
[]
[]
[]
[]
[]
[]
[]
[]
[]
[]
[]
[]
[]
[null,null,null,null,null,null,null,null,null,null,null,null,null,null,null,"no.","crop","unit","NO3-N ppm","Max        N         lbs","Recom lbs / unit","P rate","P Factor","Recom lbs / unit","K rate","K Factor","Recom lbs / unit"]
[]
[null,null,null,null,null,null,null,null,null,null,null,null,null,null,null,null,null,null,null,null,null,null,null,null,null,null,null,null,null,null,null,"pH","Coarse G","Medium G","Fine G","Coarse L","Medium L","Fine L"]
[null,null,null,null,null,null,null,null,null,null,null,null,null,null,null,1," AFRICAN MILLET  ","A",30,60,null,55,1.1000000000000001,null,40,0.32,null,"g",null,null,null,3,2,2.5,3.5,2.5,3,4]
[null,null,null,null,null,null,null,null,null,null,null,null,null,null,null,{"$f":"P53+1","v":2}," ALFALFA (IRRIGATED) 6 TON","A",10,20,null,130,2.1669999999999998,null,160,1.28,null,"l",null,null,null,{"$f":"AF53+0.1","v":3.1},2,2.5,3.5,2.5,3,4]
[null,null,null,null,null,null,null,null,null,null,null,null,null,null,null,3," ALFALFA (IRRIGATED) 8-12 TON","A",10,20,null,180,3,null,200,1.6,null,"l",null,null,null,3.2,2,2.5,3.5,2.5,3,4]
[null,null,null,null,null,null,null,null,null,null,null,null,null,null,null,4," ALFALFA (NON-IRRIGATED) 4 Ton","A",10,20,null,80,1.333,null,120,0.96,null,"l",null,null,null,3.3000000000000003,2,2.5,3.5,2.5,3,4]
[null,null,null,null,null,null,null,null,null,null,null,null,null,null,null,5," Wheat Hay (1 Ton/ac)  ","A",22.5,45,null,55,1.1000000000000001,null,120,0.96,null,"g",null,null,null,3.4000000000000004,2,2.5,3.5,2.5,3,4]
[null,null,null,null,null,null,null,null,null,null,null,null,null,null,null,6," Wheat Hay (1.5 Ton/ac)  ","A",32.5,65,null,55,1.1000000000000001,null,120,0.96,null,"g",null,null,null,3.5000000000000004,2,2.5,3.5,2.5,3,4]
[null,null,null,null,null,null,null,null,null,null,null,null,null,null,null,7," Wheat Hay (2 Ton/ac)  ","A",45,90,null,65,1.3,null,120,0.96,null,"g",null,null,null,3.6000000000000005,2,2.5,3.5,2.5,3,4]
[null,null,null,null,null,null,null,null,null,null,null,null,null,null,null,8," Wheat Hay (2.5 Ton/ac)  ","A",55,110,null,65,1.3,null,150,1,null,"g",null,null,null,3.7000000000000006,2,2.5,3.5,2.5,3,4]
[null,null,null,null,null,null,null,null,null,null,null,null,null,null,null,9," Wheat Hay (3 Ton/ac)  ","A",67.5,135,null,80,1.6,null,150,1,null,"g",null,null,null,3.8000000000000007,2,2.5,3.5,2.5,3,4]
[null,null,null,null,null,null,null,null,null,null,null,null,null,null,null,10," Wheat Hay (3.5 Ton/ac)  ","A",77.5,155,null,80,1.6,null,175,1.0940000000000001,null,"g",null,null,null,3.9000000000000008,2,2.5,3.5,2.5,3,4]
[null,null,null,null,null,null,null,null,null,null,null,null,null,null,null,11," Wheat Hay (4 Ton/ac)  ","A",90,180,null,80,1.6,null,175,1.0940000000000001,null,"g",null,null,null,4.0000000000000009,2,2.5,3.5,2.5,3,4]
[null,null,null,null,null,null,null,null,null,null,null,null,null,null,null,12,"Alfalfa - Irr. Est.","A",10,20,null,130,2.1669999999999998,null,160,1.28,null,"l",null,null,null,4.1000000000000005,2,2.5,3.5,2.5,3,4]
[null,null,null,null,null,null,null,null,null,null,null,null,null,null,null,13,"Alfalfa - Non-Irr. Est.","A",10,20,null,80,1.333,null,120,0.96,null,"l",null,null,null,4.2,2,2.5,3.5,2.5,3,4]
[null,null,null,null,null,null,null,null,null,null,null,null,null,null,null,14,"Aloe Vera","A",25,50,null,3,0.06,null,40,0.32,null,"g",null,null,null,4.3,2,2.5,3.5,2.5,3,4]
[null,null,null,null,null,null,null,null,null,null,null,null,null,null,null,15,"Apples","AS",20,1,null,38,0.75,null,150,0.95,null,"g",null,null,null,4.3999999999999995,2,2.5,3.5,2.5,3,4]
[null,null,null,null,null,null,null,null,null,null,null,null,null,null,null,16,"Athletic Fields - Low, Moderate or High Maintenance","A",30,60,null,38,0.75,null,150,0.95,null,"g",null,null,null,4.4999999999999991,2,2.5,3.5,2.5,3,4]
[null,null,null,null,null,null,null,null,null,null,null,null,null,null,null,17,"Azaleas and Camelias","AS",30,1.4,null,3,0.06,null,0,0,null,"n/a",null,null,null,4.5999999999999988,2,2.5,3.5,2.5,3,4]
[null,null,null,null,null,null,null,null,null,null,null,null,null,null,null,18,"Bahiagrass - Est.","A",20,40,null,105,2.1,null,120,0.96,null,"g",null,null,null,4.6999999999999984,2,2.5,3.5,2.5,3,4]
[null,null,null,null,null,null,null,null,null,null,null,null,null,null,null,19,"Bahiagrass Grazing 1AU/1.5ac","A",110,240,null,65,1.3,null,120,0.96,null,"g",null,null,null,4.799999999999998,2,2.5,3.5,2.5,3,4]
[null,null,null,null,null,null,null,null,null,null,null,null,null,null,null,20,"Bahiagrass Grazing 1AU/2ac","A",80,160,null,40,0.8,null,120,0.96,null,"g",null,null,null,4.8999999999999977,2,2.5,3.5,2.5,3,4]
[null,null,null,null,null,null,null,null,null,null,null,null,null,null,null,21,"Bahiagrass Grazing 1AU/3ac","A",75,150,null,40,0.8,null,100,0.8,null,"g",null,null,null,4.9999999999999973,1.5,2,2.5,2,2,3]
[null,null,null,null,null,null,null,null,null,null,null,null,null,null,null,22,"Bahiagrass Grazing 1AU/4ac","A",70,140,null,40,0.8,null,100,0.8,null,"g",null,null,null,5.099999999999997,1.5,2,2.5,2,2,3]
[null,null,null,null,null,null,null,null,null,null,null,null,null,null,null,23,"Bahiagrass Grazing 1AU/5ac","A",50,100,null,30,0.6,null,100,0.8,null,"g",null,null,null,5.1999999999999966,1.5,2,2.5,2,2,3]
[null,null,null,null,null,null,null,null,null,null,null,null,null,null,null,24,"Bahiagrass Grazing 1AU/6 + ac","A",30,60,null,30,0.6,null,80,0.64,null,"g",null,null,null,5.2999999999999963,1.5,2,2.5,2,2,3]
[null,null,null,null,null,null,null,null,null,null,null,null,null,null,null,25,"Bahiagrass Hay  (1 cutting + grazing)","A",65,130,null,65,1.3,null,120,0.96,null,"g",null,null,null,5.3999999999999959,1.5,2,2.5,2,2,3]
[null,null,null,null,null,null,null,null,null,null,null,null,null,null,null,26,"Bahiagrass Hay  10000 lb","A",210,420,null,110,2.2000000000000002,null,250,1.667,null,"g",null,null,null,5.4999999999999956,1,1,1.5,1,1.5,2]
[null,null,null,null,null,null,null,null,null,null,null,null,null,null,null,27,"Bahiagrass Hay  6000 lb","A",70,140,null,40,0.8,null,90,0.72,null,"g",null,null,null,5.5999999999999952,1,1,1.5,1,1.5,2]
[null,null,null,null,null,null,null,null,null,null,null,null,null,null,null,28,"Bahiagrass Hay  8000 lb","A",105,210,null,80,1.6,null,180,1.44,null,"g",null,null,null,5.6999999999999948,1,1,1.5,1,1.5,2]
[null,null,null,null,null,null,null,null,null,null,null,null,null,null,null,29,"Barley 30 - 40 bu","A",25,50,null,56,1.1299999999999999,null,40,0.32,null,"g",null,null,null,5.7999999999999945,1,1,1.5,1,1.5,2]
[null,null,null,null,null,null,null,null,null,null,null,null,null,null,null,30,"Barley 70 - 90 bu","A",50,100,null,81,1.63,null,90,0.71,null,"g",null,null,null,5.8999999999999941,1,1,1.5,1,1.5,2]
[null,null,null,null,null,null,null,null,null,null,null,null,null,null,null,31,"Barley 70 - 90 bu + Light grazing","A",50,100,null,80,1.6,null,90,0.72,null,"g",null,null,null,5.9999999999999938,1,1,1.5,1,1,1.5]
[null,null,null,null,null,null,null,null,null,null,null,null,null,null,null,32,"Barley heavy grazing ","A",80,160,null,105,2.1,null,120,0.96,null,"g",null,null,null,6.0999999999999934,0,0,0,1,1,1.5]
[null,null,null,null,null,null,null,null,null,null,null,null,null,null,null,33,"Barley heavy grazing, sandy soils","A",110,220,null,105,2.1,null,120,0.96,null,"g",null,null,null,6.1999999999999931,0,0,0,1,1,1.5]
[null,null,null,null,null,null,null,null,null,null,null,null,null,null,null,34,"Beans, Green","A",25,50,null,106,2.13,null,120,0.95,null,"l",null,null,null,6.2999999999999927,0,0,0,1,1,1.5]
[null,null,null,null,null,null,null,null,null,null,null,null,null,null,null,35,"Beans, Lima","A",25,50,null,106,2.13,null,120,0.95,null,"l",null,null,null,6.3999999999999924,0,0,0,1,1,1.5]
[null,null,null,null,null,null,null,null,null,null,null,null,null,null,null,36,"Beans, Pinto","A",25,50,null,106,2.13,null,120,0.95,null,"l",null,null,null,6.499999999999992,0,0,0,1,1,1.5]
[null,null,null,null,null,null,null,null,null,null,null,null,null,null,null,37,"Beets","A",35,70,null,106,2.13,null,90,0.71,null,"g",null,null,null,6.5999999999999917,0,0,0,0,0,0]
[null,null,null,null,null,null,null,null,null,null,null,null,null,null,null,38,"Bermudagrass, Common - Est.","A",20,40,null,105,2.1,null,100,0.8,null,"g",null,null,null,6.6999999999999913,0,0,0,0,0,0]
[null,null,null,null,null,null,null,null,null,null,null,null,null,null,null,39,"Bermudagrass, Common, Grazing  1 AU/1.5 ac","A",120,240,null,65,1.3,null,80,0.64,null,"g",null,null,null,6.7999999999999909,0,0,0,0,0,0]
[null,null,null,null,null,null,null,null,null,null,null,null,null,null,null,40,"Bermudagrass, Common, Grazing  1 AU/2 ac","A",90,180,null,40,0.8,null,50,0.33300000000000002,null,"g",null,null,null,6.8999999999999906,0,0,0,0,0,0]
[null,null,null,null,null,null,null,null,null,null,null,null,null,null,null,41,"Bermudagrass, Common, Grazing 1AU/3 ac","A",90,180,null,40,0.8,null,50,0.33300000000000002,null,"g",null,null,null,6.9999999999999902,0,0,0,0,0,0]
[null,null,null,null,null,null,null,null,null,null,null,null,null,null,null,42,"Bermudagrass, Common, Grazing 1AU/4ac","A",80,160,null,40,0.8,null,50,0.33300000000000002,null,"g",null,null,null,7.0999999999999899,0,0,0,0,0,0]
[null,null,null,null,null,null,null,null,null,null,null,null,null,null,null,43,"Bermudagrass, Common, Grazing 1AU/5ac","A",70,140,null,30,0.6,null,50,0.33300000000000002,null,"g",null,null,null,7.1999999999999895,0,0,0,0,0,0]
[null,null,null,null,null,null,null,null,null,null,null,null,null,null,null,44,"Bermudagrass, Common, Grazing 1AU/6ac","A",50,100,null,30,0.6,null,50,0.33300000000000002,null,"g",null,null,null,7.2999999999999892,0,0,0,0,0,0]
[null,null,null,null,null,null,null,null,null,null,null,null,null,null,null,45,"Bermudagrass, Common, Grazing 1AU/9+ac","A",40,60,null,30,0.6,null,50,0.33300000000000002,null,"g",null,null,null,7.3999999999999888,0,0,0,0,0,0]
[null,null,null,null,null,null,null,null,null,null,null,null,null,null,null,46,"Bermudagrass, Common, Hay  5000 lb","A",70,140,null,40,0.8,null,100,0.8,null,"g",null,null,null,7.4999999999999885,0,0,0,0,0,0]
[null,null,null,null,null,null,null,null,null,null,null,null,null,null,null,47,"Bermudagrass, Common, Hay  6000 lb","A",105,210,null,65,1.3,null,170,1.0669999999999999,null,"g",null,null,null,7.5999999999999881,0,0,0,0,0,0]
[null,null,null,null,null,null,null,null,null,null,null,null,null,null,null,48,"Bermudagrass, Common, Hay  8000 lb","A",140,280,null,80,1.6,null,240,1.0669999999999999,null,"g",null,null,null,7.6999999999999877,0,0,0,0,0,0]
[null,null,null,null,null,null,null,null,null,null,null,null,null,null,null,49,"Bermudagrass, Common, Hay  9500 lb","A",210,420,null,80,1.6,null,310,1.409,null,"g",null,null,null,7.7999999999999874,0,0,0,0,0,0]
[null,null,null,null,null,null,null,null,null,null,null,null,null,null,null,50,"Bermudagrass, Common, Hay (1 cut + grazing)","A",65,130,null,65,1.3,null,90,0.72,null,"g",null,null,null,7.899999999999987,0,0,0,0,0,0]
[null,null,null,null,null,null,null,null,null,null,null,null,null,null,null,51,"Bermudagrass, Hyb, Grazing 1 AU/.5ac","A",150,300,null,65,1.6,null,120,0.96,null,"g",null,null,null,7.9999999999999867,0,0,0,0,0,0]
[null,null,null,null,null,null,null,null,null,null,null,null,null,null,null,52,"Bermudagrass, Hyb, Grazing 1 AU/1ac","A",135,270,null,65,1.6,null,120,0.96,null,"g",null,null,null,8.0999999999999872,0,0,0,0,0,0]
[null,null,null,null,null,null,null,null,null,null,null,null,null,null,null,53,"Bermudagrass, Hyb, Grazing 1AU/2ac","A",100,200,null,65,1.6,null,120,0.96,null,"g",null,null,null,8.1999999999999869,0,0,0,0,0,0]
[null,null,null,null,null,null,null,null,null,null,null,null,null,null,null,54,"Bermudagrass, Hyb, Grazing 1AU/3ac","A",80,160,null,65,1.3,null,120,0.96,null,"g",null,null,null,8.2999999999999865,0,0,0,0,0,0]
[null,null,null,null,null,null,null,null,null,null,null,null,null,null,null,55,"Bermudagrass, Hyb, Grazing 1AU/4ac","A",60,120,null,65,1.3,null,100,0.8,null,"g",null,null,null,8.3999999999999861,0,0,0,0,0,0]
[null,null,null,null,null,null,null,null,null,null,null,null,null,null,null,56,"Bermudagrass, Hyb, Grazing 1AU/5ac","A",45,90,null,50,1,null,100,0.8,null,"g",null,null,null,8.4999999999999858,0,0,0,0,0,0]
[null,null,null,null,null,null,null,null,null,null,null,null,null,null,null,57,"Bermudagrass, Hyb, Grazing 1AU/6 + ac","A",30,60,null,50,1,null,80,0.64,null,"g",null,null,null,8.5999999999999854,0,0,0,0,0,0]
[null,null,null,null,null,null,null,null,null,null,null,null,null,null,null,58,"Bermudagrass, Hyb, Hay  (1 cut + grazing)","A",85,170,null,65,1.3,null,150,1,null,"g",null,null,null,8.6999999999999851,0,0,0,0,0,0]
[null,null,null,null,null,null,null,null,null,null,null,null,null,null,null,59,"Bermudagrass, Hyb, Hay  10000 lb","A",125,250,null,115,2.2999999999999998,null,225,1.5,null,"g",null,null,null,8.7999999999999847,0,0,0,0,0,0]
[null,null,null,null,null,null,null,null,null,null,null,null,null,null,null,60,"Bermudagrass, Hyb, Hay  12000 lb","A",150,300,null,140,2.8,null,250,1.667,null,"g",null,null,null,8.8999999999999844,0,0,0,0,0,0]
[null,null,null,null,null,null,null,null,null,null,null,null,null,null,null,61,"Bermudagrass, Hyb, Hay  15000 lb","A",187.5,375,null,150,3,null,275,1.833,null,"g",null,null,null,8.999999999999984,0,0,0,0,0,0]
[null,null,null,null,null,null,null,null,null,null,null,null,null,null,null,62,"Bermudagrass, Hyb, Hay  16000 lb","A",200,400,null,165,3.3,null,300,1.667,null,"g",null,null,null,9.0999999999999837,0,0,0,0,0,0]
[null,null,null,null,null,null,null,null,null,null,null,null,null,null,null,63,"Bermudagrass, Hyb, Hay  18000 lb","A",225,450,null,175,3.5,null,300,2,null,"g",null,null,null,9.1999999999999833,0,0,0,0,0,0]
[null,null,null,null,null,null,null,null,null,null,null,null,null,null,null,64,"Bermudagrass, Hyb, Hay  20000 lb ","A",250,500,null,200,4,null,350,1.944,null,"g",null,null,null,9.2999999999999829,0,0,0,0,0,0]
[null,null,null,null,null,null,null,null,null,null,null,null,null,null,null,65,"Bermudagrass, Hyb, Hay  3000 lb","A",37.5,75,null,50,1,null,125,1,null,"g",null,null,null,9.3999999999999826,0,0,0,0,0,0]
[null,null,null,null,null,null,null,null,null,null,null,null,null,null,null,{"$f":"P117+1","v":66},"Bermudagrass, Hyb, Hay  4000 lb","A",50,100,null,65,1.3,null,150,1.2,null,"g",null,null,null,{"$f":"AF117+0.1","v":9.4999999999999822},0,0,0,0,0,0]
[null,null,null,null,null,null,null,null,null,null,null,null,null,null,null,67,"Bermudagrass, Hyb, Hay  5000 lb","A",62.5,125,null,80,1.6,null,175,1.4,null,"g",null,null,null,9.5999999999999819,0,0,0,0,0,0]
[null,null,null,null,null,null,null,null,null,null,null,null,null,null,null,68,"Bermudagrass, Hyb, Hay  6000 lb","A",75,150,null,100,2,null,200,1.333,null,"g",null,null,null,9.6999999999999815,0,0,0,0,0,0]
[null,null,null,null,null,null,null,null,null,null,null,null,null,null,null,69,"Bermudagrass, Hyb, Hay  8000 lb ","A",100,200,null,100,2,null,200,1.33,null,"g",null,null,null,9.7999999999999812,0,0,0,0,0,0]
[null,null,null,null,null,null,null,null,null,null,null,null,null,null,null,70,"Bermudagrass, Hyb, Hay  9000 lb","A",112.5,225,null,100,2,null,200,1.33,null,"g",null,null,null,9.8999999999999808,0,0,0,0,0,0]
[null,null,null,null,null,null,null,null,null,null,null,null,null,null,null,71,"Bermudagrass, Hyb, Irr. Hay  24000 lb","A",300,600,null,240,4.8,null,400,2.222,null,"g",null,null,null,9.9999999999999805,0,0,0,0,0,0]
[null,null,null,null,null,null,null,null,null,null,null,null,null,null,null,72,"Bermudagrass, Hyb, Irr. Hay  28000 lb","A",350,700,null,275,5.5,null,450,2.5,null,"g",null,null,null,10.09999999999998,0,0,0,0,0,0]
[null,null,null,null,null,null,null,null,null,null,null,null,null,null,null,73,"Bermudagrass, Hyb, Irr. Hay  30000 lb","A",375,750,null,275,5.5,null,425,2.3610000000000002,null,"g",null,null,null,10.19999999999998,0,0,0,0,0,0]
[null,null,null,null,null,null,null,null,null,null,null,null,null,null,null,74,"Bermudagrass, Hyb, Irr. Hay  35000 lb","A",437.5,875,null,300,6,null,475,2.6389999999999998,null,"g",null,null,null,10.299999999999979,0,0,0,0,0,0]
[null,null,null,null,null,null,null,null,null,null,null,null,null,null,null,75,"Bermudagrass, Hyb, Irr. Hay  36000 lb","A",450,900,null,300,6,null,450,2.5,null,"g",null,null,null,10.399999999999979,0,0,0,0,0,0]
[null,null,null,null,null,null,null,null,null,null,null,null,null,null,null,76,"Bermudagrass, Hyb, Irr. Hay  42000 lb","A",525,1050,null,325,6.5,null,500,2.778,null,"g",null,null,null,10.499999999999979,0,0,0,0,0,0]
[null,null,null,null,null,null,null,null,null,null,null,null,null,null,null,77,"Bermudagrass, Improved - Irr. Est.","A",20,40,null,105,2.1,null,100,0.8,null,"g",null,null,null,10.599999999999978,0,0,0,0,0,0]
[null,null,null,null,null,null,null,null,null,null,null,null,null,null,null,78,"Bermudagrass, Improved - non-irr. Est","A",20,40,null,105,2.1,null,100,0.8,null,"g",null,null,null,10.699999999999978,0,0,0,0,0,0]
[null,null,null,null,null,null,null,null,null,null,null,null,null,null,null,79,"Bermudagrass, NK-37 or Midland - Est","A",20,40,null,55,1.1000000000000001,null,40,0.88900000000000001,null,"g",null,null,null,10.799999999999978,0,0,0,0,0,0]
[null,null,null,null,null,null,null,null,null,null,null,null,null,null,null,80,"Bermudagrass, NK-37 or Midland 12000 lb","A",210,420,null,110,2.2000000000000002,null,310,1.409,null,"g",null,null,null,10.899999999999977,0,0,0,0,0,0]
[null,null,null,null,null,null,null,null,null,null,null,null,null,null,null,81,"Bermudagrass, NK-37 or Midland 7000 lb","A",100,200,null,105,2.1,null,200,1.6,null,"g",null,null,null,10.999999999999977,0,0,0,0,0,0]
[null,null,null,null,null,null,null,null,null,null,null,null,null,null,null,82,"Bermudagrass, NK-37 or Midland Grazing","A",80,160,null,80,1.6,null,120,0.96,null,"g"]
[null,null,null,null,null,null,null,null,null,null,null,null,null,null,null,83,"Blue Panic - Est.","A",20,40,null,55,1.1000000000000001,null,40,0.32,null,"g"]
[null,null,null,null,null,null,null,null,null,null,null,null,null,null,null,84,"Blue Panic, grazing","A",65,130,null,55,1.1000000000000001,null,40,0.32,null,"g"]
[null,null,null,null,null,null,null,null,null,null,null,null,null,null,null,85,"Blueberry","A",30,60,null,31,0.63,null,0,0,null,"n/a"]
[null,null,null,null,null,null,null,null,null,null,null,null,null,null,null,86,"Bluestems - Est","A",20,40,null,55,1.1000000000000001,null,40,0.32,null,"g"]
[null,null,null,null,null,null,null,null,null,null,null,null,null,null,null,87,"Bluestems, Native or KR Grazing or Hay","A",65,130,null,55,1.1000000000000001,null,120,0.96,null,"g"]
[null,null,null,null,null,null,null,null,null,null,null,null,null,null,null,88,"Bluestems, OW Improved, Grazing or Hay","A",120,240,null,65,1.3,null,120,0.92300000000000004,null,"g"]
[null,null,null,null,null,null,null,null,null,null,null,null,null,null,null,89,"Broccoli - Field Production","A",40,80,null,106,1.77,null,80,0.64,null,"g"]
[null,null,null,null,null,null,null,null,null,null,null,null,null,null,null,90,"Buffelgrass - Est","A",20,40,null,105,2.1,null,120,0.96,null,"g"]
[null,null,null,null,null,null,null,null,null,null,null,null,null,null,null,91,"Buffelgrass (Heavy Grazing or Hay + Graze)","A",105,210,null,65,1.3,null,120,0.96,null,"g"]
[null,null,null,null,null,null,null,null,null,null,null,null,null,null,null,92,"Buffelgrass (Moderate Grazing)","A",75,150,null,65,1.3,null,120,0.96,null,"g"]
[null,null,null,null,null,null,null,null,null,null,null,null,null,null,null,93,"Buffelgrass Hay 4000 lb","A",40,80,null,65,1.3,null,80,0.64,null,"g"]
[null,null,null,null,null,null,null,null,null,null,null,null,null,null,null,94,"Buffelgrass Hay 6000 lb","A",80,160,null,80,1.3,null,100,0.8,null,"g"]
[null,null,null,null,null,null,null,null,null,null,null,null,null,null,null,95,"Buffelgrass Hay 8000 lb","A",120,240,null,105,2.1,null,120,0.96,null,"g"]
[null,null,null,null,null,null,null,null,null,null,null,null,null,null,null,96,"Cabbage - Field Production","A",50,100,null,131,2.19,null,160,1.27,null,"g"]
[null,null,null,null,null,null,null,null,null,null,null,null,null,null,null,97,"Cabbage-Chinese","A",50,100,null,131,2.19,null,160,1.27,null,"g"]
[null,null,null,null,null,null,null,null,null,null,null,null,null,null,null,98,"Cane","A",30,60,null,55,1.1000000000000001,null,40,0.308,null,"g"]
[null,null,null,null,null,null,null,null,null,null,null,null,null,null,null,99,"Cantaloupe - Field Production","A",20,40,null,106,1.77,null,80,0.64,null,"g"]
[null,null,null,null,null,null,null,null,null,null,null,null,null,null,null,100,"Carrots - Field Production","A",40,80,null,106,2.13,null,120,0.95,null,"g"]
[null,null,null,null,null,null,null,null,null,null,null,null,null,null,null,101,"Cauliflower - Field Production","A",40,80,null,106,2.13,null,120,0.95,null,"g"]
[null,null,null,null,null,null,null,null,null,null,null,null,null,null,null,102,"Citrus","A",50,100,null,81,1.63,null,130,0.95,null,"g"]
[null,null,null,null,null,null,null,null,null,null,null,null,null,null,null,103,"Clover, Vetch (Prepared Seedbed)","A",5,10,null,105,2.1,null,120,0.68600000000000005,null,"l"]
[null,null,null,null,null,null,null,null,null,null,null,null,null,null,null,104,"Clover, Vetch (Sod Seeded)","A",30,60,null,105,2.1,null,120,0.68600000000000005,null,"l"]
[null,null,null,null,null,null,null,null,null,null,null,null,null,null,null,105,"Clover, Vetch + Ryegrass or Sm.Grain","A",55,110,null,105,2.1,null,120,0.68600000000000005,null,"l"]
[null,null,null,null,null,null,null,null,null,null,null,null,null,null,null,106,"Collards","A",40,80,null,106,2.13,null,120,0.95,null,"g"]
[null,null,null,null,null,null,null,null,null,null,null,null,null,null,null,107,"Corn 111 - 130 bu","A",72,144,null,106,2.13,null,130,1.03,null,"g"]
[null,null,null,null,null,null,null,null,null,null,null,null,null,null,null,108,"Corn 131 - 150 bu","A",82,164,null,106,2.13,null,130,1.03,null,"g"]
[null,null,null,null,null,null,null,null,null,null,null,null,null,null,null,109,"Corn 151 - 170 bu","A",90,180,null,131,2.63,null,140,1.1499999999999999,null,"g"]
[null,null,null,null,null,null,null,null,null,null,null,null,null,null,null,110,"Corn 171 - 190 bu","A",105,210,null,131,2.63,null,140,1.1000000000000001,null,"g"]
[null,null,null,null,null,null,null,null,null,null,null,null,null,null,null,111,"Corn 191 - 210 bu","A",125,250,null,131,2.63,null,140,1.05,null,"g"]
[null,null,null,null,null,null,null,null,null,null,null,null,null,null,null,112,"Corn 211 - 230 bu","A",140,280,null,131,2.63,null,150,1.1000000000000001,null,"g"]
[null,null,null,null,null,null,null,null,null,null,null,null,null,null,null,113,"Corn 231 - 250 bu","A",150,300,null,131,2.63,null,150,1.05,null,"g"]
[null,null,null,null,null,null,null,null,null,null,null,null,null,null,null,114,"Corn 50 - 70 bu","A",35,70,null,81,1.63,null,80,0.64,null,"g"]
[null,null,null,null,null,null,null,null,null,null,null,null,null,null,null,115,"Corn 71 - 90 bu","A",45,90,null,81,1.63,null,80,0.64,null,"g"]
[null,null,null,null,null,null,null,null,null,null,null,null,null,null,null,116,"Corn 91 - 110 bu","A",60,120,null,106,2.13,null,110,0.75,null,"g"]
[null,null,null,null,null,null,null,null,null,null,null,null,null,null,null,117,"Cotton 0.5 bale","A",12.5,25,null,56,1.1299999999999999,null,30,0.24,null,"g"]
[null,null,null,null,null,null,null,null,null,null,null,null,null,null,null,118,"Cotton 0.75 bale","A",18.75,37.5,null,56,1.1299999999999999,null,30,0.24,null,"g"]
[null,null,null,null,null,null,null,null,null,null,null,null,null,null,null,119,"Cotton 1 bale","A",25,50,null,56,1.1299999999999999,null,30,0.24,null,"g"]
[null,null,null,null,null,null,null,null,null,null,null,null,null,null,null,120,"Cotton 1.25 bale","A",31.25,62.5,null,81,1.63,null,50,0.4,null,"g"]
[null,null,null,null,null,null,null,null,null,null,null,null,null,null,null,121,"Cotton 1.5 bale","A",37.5,75,null,81,1.63,null,50,0.4,null,"g"]
[null,null,null,null,null,null,null,null,null,null,null,null,null,null,null,122,"Cotton 1.75 bale","A",43.75,87.5,null,106,2.13,null,120,0.95,null,"g"]
[null,null,null,null,null,null,null,null,null,null,null,null,null,null,null,123,"Cotton 2 bale","A",50,100,null,106,2.13,null,120,0.95,null,"g"]
[null,null,null,null,null,null,null,null,null,null,null,null,null,null,null,124,"Cotton 2.25 bale","A",56.25,112.5,null,106,2.13,null,120,0.95,null,"g"]
[null,null,null,null,null,null,null,null,null,null,null,null,null,null,null,125,"Cotton 2.5 bale","A",62.5,125,null,106,2.13,null,120,0.95,null,"g"]
[null,null,null,null,null,null,null,null,null,null,null,null,null,null,null,126,"Cotton 2.75 bale","A",68.75,137.5,null,106,2.13,null,120,0.95,null,"g"]
[null,null,null,null,null,null,null,null,null,null,null,null,null,null,null,127,"Cotton 3 bale","A",75,150,null,106,2.13,null,120,0.95,null,"g"]
[null,null,null,null,null,null,null,null,null,null,null,null,null,null,null,128,"Cucumbers - Field Production","A",40,80,null,106,1.77,null,80,0.64,null,"g"]
[null,null,null,null,null,null,null,null,null,null,null,null,null,null,null,129,"Dallis Grass (1 cutting plus grazing)","A",115,230,null,65,1.3,null,120,0.96,null,"g"]
[null,null,null,null,null,null,null,null,null,null,null,null,null,null,null,{"$f":"P181+1","v":130},"Dallis Grass, Grazing, 1AU/1 - 1.5 ac","A",115,230,null,65,1.3,null,120,0.96,null,"g"]
[null,null,null,null,null,null,null,null,null,null,null,null,null,null,null,131,"Dallis Grass, Grazing, 1AU/1.5 - 2 ac","A",95,190,null,65,1.3,null,120,0.96,null,"g"]
[null,null,null,null,null,null,null,null,null,null,null,null,null,null,null,132,"Dallisgrass - Est","A",20,40,null,105,2.1,null,120,0.96,null,"g"]
[null,null,null,null,null,null,null,null,null,null,null,null,null,null,null,133,"Desoto Grass","A",20,40,null,55,1.1000000000000001,null,120,0.96,null,"g"]
[null,null,null,null,null,null,null,null,null,null,null,null,null,null,null,134,"Eggplant - Field Production","A",60,120,null,106,1.77,null,120,0.95,null,"g"]
[null,null,null,null,null,null,null,null,null,null,null,null,null,null,null,135,"Establishment",null,null,null,null,null,null,null,null,null,null,"g"]
[null,null,null,null,null,null,null,null,null,null,null,null,null,null,null,136,"Fescue Est.","A",20,40,null,80,1.6,null,60,0.48,null,"g"]
[null,null,null,null,null,null,null,null,null,null,null,null,null,null,null,137,"Fescue, 3-4 AU/ac or Hay","A",60,120,null,80,1.6,null,120,0.96,null,"g"]
[null,null,null,null,null,null,null,null,null,null,null,null,null,null,null,138,"Flax","A",20,40,null,56,1.1299999999999999,null,40,0.32,null,"g"]
[null,null,null,null,null,null,null,null,null,null,null,null,null,null,null,139,"Flowers","S",30,1.5,null,3,0.06,null,0,0,null,"g"]
[null,null,null,null,null,null,null,null,null,null,null,null,null,null,null,140,"Forage Sorghum","A",20,40,null,55,1.1000000000000001,null,120,0.96,null,"g"]
[null,null,null,null,null,null,null,null,null,null,null,null,null,null,null,141,"Fruit trees","S",30,1.38,null,3,0.06,null,0,0,null,"g"]
[null,null,null,null,null,null,null,null,null,null,null,null,null,null,null,142,"Garden","AS",30,1.38,null,4,0.08,null,0,0,null,"g"]
[null,null,null,null,null,null,null,null,null,null,null,null,null,null,null,143,"Garlic","A",50,100,null,131,2.63,null,100,0.79,null,"g"]
[null,null,null,null,null,null,null,null,null,null,null,null,null,null,null,144,"Golf Greens - Native and Pushup","S",30,1.5,null,100,2,null,0,0,null,"g"]
[null,null,null,null,null,null,null,null,null,null,null,null,null,null,null,145,"Golf Greens - Sand Based","S",30,1.5,null,100,2,null,0,0,null,"g"]
[null,null,null,null,null,null,null,null,null,null,null,null,null,null,null,146,"Grain Sorghum 1000 lb","A",10,20,null,31,0.6,null,10,0.16,null,"g"]
[null,null,null,null,null,null,null,null,null,null,null,null,null,null,null,147,"Grain Sorghum 1500 lb","A",15,30,null,31,0.6,null,15,0.16,null,"g"]
[null,null,null,null,null,null,null,null,null,null,null,null,null,null,null,148,"Grain Sorghum 2000 lb","A",20,40,null,31,0.6,null,20,0.16,null,"g"]
[null,null,null,null,null,null,null,null,null,null,null,null,null,null,null,149,"Grain Sorghum 2500 lb","A",25,50,null,56,1.1299999999999999,null,60,0.64,null,"g"]
[null,null,null,null,null,null,null,null,null,null,null,null,null,null,null,150,"Grain Sorghum 3000 lb","A",30,60,null,56,1.1299999999999999,null,60,0.64,null,"g"]
[null,null,null,null,null,null,null,null,null,null,null,null,null,null,null,151,"Grain Sorghum 3500 lb","A",35,70,null,56,1.1299999999999999,null,70,0.64,null,"g"]
[null,null,null,null,null,null,null,null,null,null,null,null,null,null,null,152,"Grain Sorghum 4000 lb","A",40,80,null,56,1.1299999999999999,null,80,0.64,null,"g"]
[null,null,null,null,null,null,null,null,null,null,null,null,null,null,null,153,"Grain Sorghum 4500 lb","A",45,90,null,81,1.63,null,100,0.79,null,"g"]
[null,null,null,null,null,null,null,null,null,null,null,null,null,null,null,154,"Grain Sorghum 5000 lb","A",50,100,null,81,1.63,null,100,0.79,null,"g"]
[null,null,null,null,null,null,null,null,null,null,null,null,null,null,null,155,"Grain Sorghum 5500 lb","A",55,110,null,81,1.63,null,100,0.79,null,"g"]
[null,null,null,null,null,null,null,null,null,null,null,null,null,null,null,156,"Grain Sorghum 6000 lb","A",60,120,null,81,1.63,null,100,0.79,null,"g"]
[null,null,null,null,null,null,null,null,null,null,null,null,null,null,null,157,"Grain Sorghum 6500 lb","A",65,130,null,131,2.13,null,120,0.95,null,"g"]
[null,null,null,null,null,null,null,null,null,null,null,null,null,null,null,158,"Grain Sorghum 7000 lb","A",70,140,null,131,2.13,null,120,0.95,null,"g"]
[null,null,null,null,null,null,null,null,null,null,null,null,null,null,null,159,"Grain Sorghum 7500 lb","A",75,150,null,131,2.13,null,120,0.95,null,"g"]
[null,null,null,null,null,null,null,null,null,null,null,null,null,null,null,160,"Grain Sorghum 8000 lb","A",80,160,null,131,2.13,null,120,0.95,null,"g"]
[null,null,null,null,null,null,null,null,null,null,null,null,null,null,null,161,"Grapes - Field Production","A",12.5,25,null,31,0.63,null,50,0.33,null,"g"]
[null,null,null,null,null,null,null,null,null,null,null,null,null,null,null,162,"Guar","A",10,20,null,81,1.63,null,60,0.48,null,"g"]
[null,null,null,null,null,null,null,null,null,null,null,null,null,null,null,163,"Hay Grazer (1 cutting or light grazing)","A",40,80,null,55,1.1000000000000001,null,40,0.32,null,"g"]
[null,null,null,null,null,null,null,null,null,null,null,null,null,null,null,164,"Hay Grazer (2 cuttings or moderate grazing)","A",70,140,null,55,1.1000000000000001,null,120,0.96,null,"g"]
[null,null,null,null,null,null,null,null,null,null,null,null,null,null,null,165,"Hay Grazer (3 cuttings or heavy grazing)","A",100,200,null,105,2.1,null,120,0.96,null,"g"]
[null,null,null,null,null,null,null,null,null,null,null,null,null,null,null,166,"Hegari","A",30,60,null,80,1.6,null,60,0.48,null,"g"]
[null,null,null,null,null,null,null,null,null,null,null,null,null,null,null,167,"Huban Clover","A",10,20,null,80,1.6,null,60,0.48,null,"l"]
[null,null,null,null,null,null,null,null,null,null,null,null,null,null,null,168,"Johnson Grass 1 cutting or light grazing","A",40,80,null,55,1.1000000000000001,null,40,0.32,null,"g"]
[null,null,null,null,null,null,null,null,null,null,null,null,null,null,null,169,"Johnson Grass 2 cuttings or moderate grazing","A",70,140,null,55,1.1000000000000001,null,40,0.32,null,"g"]
[null,null,null,null,null,null,null,null,null,null,null,null,null,null,null,170,"Johnson Grass 3 cuttings or heavy grazing","A",100,200,null,105,2.1,null,120,0.96,null,"g"]
[null,null,null,null,null,null,null,null,null,null,null,null,null,null,null,171,"Kenaf","A",50,100,null,69,1.38,null,120,0.95,null,"g"]
[null,null,null,null,null,null,null,null,null,null,null,null,null,null,null,172,"Kleingrass - Est.","A",20,40,null,55,1.1000000000000001,null,60,0.48,null,"g"]
[null,null,null,null,null,null,null,null,null,null,null,null,null,null,null,173,"Kleingrass Grazing 1 AU/1.25 - 1.75 ac or Hay","A",75,150,null,80,1.6,null,120,0.96,null,"g"]
[null,null,null,null,null,null,null,null,null,null,null,null,null,null,null,174,"Kleingrass Grazing 1 AU/2 - 3 ac or Hay","A",65,110,null,55,1.1000000000000001,null,50,0.4,null,"g"]
[null,null,null,null,null,null,null,null,null,null,null,null,null,null,null,175,"Kleingrass Grazing 1 AU/4ac","A",40,80,null,55,1.1000000000000001,null,50,0.4,null,"g"]
[null,null,null,null,null,null,null,null,null,null,null,null,null,null,null,176,"Kleingrass Grazing 1 AU/6+ ac","A",25,50,null,55,1.1000000000000001,null,50,0.4,null,"g"]
[null,null,null,null,null,null,null,null,null,null,null,null,null,null,null,177,"Landscape","S",30,1.38,null,4,0.08,null,0,0,null,"g"]
[null,null,null,null,null,null,null,null,null,null,null,null,null,null,null,178,"Lawn - Bermuda, St. Augustine, or Zoyzia","AS",22,1.02,null,3,0.06,null,0,0,null,"g"]
[null,null,null,null,null,null,null,null,null,null,null,null,null,null,null,179,"Lawn - Est.","AS",12,0.57999999999999996,null,4,0.08,null,0,0,null,"g"]
[null,null,null,null,null,null,null,null,null,null,null,null,null,null,null,180,"Lawn - Fescue, Buffalograss and other","AS",22,1.02,null,3,0.06,null,0,0,null,"g"]
[null,null,null,null,null,null,null,null,null,null,null,null,null,null,null,181,"Lettuce 10 T","A",50,100,null,131,2.63,null,120,0.95,null,"g"]
[null,null,null,null,null,null,null,null,null,null,null,null,null,null,null,182,"Lovegrass - Est.","A",20,40,null,55,1.1000000000000001,null,40,0.32,null,"g"]
[null,null,null,null,null,null,null,null,null,null,null,null,null,null,null,183,"Lovegrass Grazing or Hay","A",35,70,null,55,1.1000000000000001,null,70,0.318,null,"g"]
[null,null,null,null,null,null,null,null,null,null,null,null,null,null,null,184,"Mexican Wheat","A",30,60,null,55,1.1000000000000001,null,60,0.32400000000000001,null,"g"]
[null,null,null,null,null,null,null,null,null,null,null,null,null,null,null,185,"Millet (1 hay cutting or light grazing)","A",20,40,null,55,1.1000000000000001,null,40,0.32,null,"g"]
[null,null,null,null,null,null,null,null,null,null,null,null,null,null,null,186,"Millet (2 hay cutting or moderate grazing)","A",50,100,null,65,1.3,null,40,0.4,null,"g"]
[null,null,null,null,null,null,null,null,null,null,null,null,null,null,null,187,"Mustard","A",25,50,null,106,2.13,null,120,0.95,null,"g"]
[null,null,null,null,null,null,null,null,null,null,null,null,null,null,null,188,"Oats (Sod Seeded) Grazing","A",70,140,null,80,1.6,null,100,0.8,null,"g"]
[null,null,null,null,null,null,null,null,null,null,null,null,null,null,null,189,"Oats 60 - 80 Bu","A",40,80,null,56,1.1299999999999999,null,40,0.32,null,"g"]
[null,null,null,null,null,null,null,null,null,null,null,null,null,null,null,190,"Oats 81 - 100 Bu","A",50,100,null,106,2.13,null,100,0.79,null,"g"]
[null,null,null,null,null,null,null,null,null,null,null,null,null,null,null,191,"Oats Hay only, 2 - 3 T","A",40,80,null,55,1.1000000000000001,null,40,0.32,null,"g"]
[null,null,null,null,null,null,null,null,null,null,null,null,null,null,null,192,"Oats Heavy Grazing plus hay or grain","A",110,220,null,80,1.6,null,120,0.96,null,"g"]
[null,null,null,null,null,null,null,null,null,null,null,null,null,null,null,193,"Oats Light Grazing","A",60,120,null,55,1.1000000000000001,null,60,0.48,null,"g"]
[null,null,null,null,null,null,null,null,null,null,null,null,null,null,null,{"$f":"P245+1","v":194},"Oats Moderate Grazing","A",80,160,null,80,1.6,null,120,0.96,null,"g"]
[null,null,null,null,null,null,null,null,null,null,null,null,null,null,null,195,"Okra","A",20,40,null,81,1.63,null,80,0.64,null,"g"]
[null,null,null,null,null,null,null,null,null,null,null,null,null,null,null,196,"Onions ","A",50,100,null,131,2.63,null,100,0.79,null,"g"]
[null,null,null,null,null,null,null,null,null,null,null,null,null,null,null,197,"Peach - Est.","A",20,40,null,75,1.5,null,150,0.95,null,"g"]
[null,null,null,null,null,null,null,null,null,null,null,null,null,null,null,198,"Peaches - Production","A",20,40,null,50,1,null,150,0.95,null,"g"]
[null,null,null,null,null,null,null,null,null,null,null,null,null,null,null,199,"Peanuts, Dryland, 1000 - 3500 lb","A",10,20,null,69,1.38,null,61,0.28999999999999998,null,"l"]
[null,null,null,null,null,null,null,null,null,null,null,null,null,null,null,200,"Peanuts, Irrigated, 4000 - 5000 lb","A",10,20,null,94,1.88,null,82,0.39,null,"l"]
[null,null,null,null,null,null,null,null,null,null,null,null,null,null,null,201,"Peas, Blackeye","A",10,20,null,56,1.1299999999999999,null,40,0.32,null,"l"]
[null,null,null,null,null,null,null,null,null,null,null,null,null,null,null,202,"Peas, Green","A",30,60,null,56,1.1299999999999999,null,40,0.32,null,"l"]
[null,null,null,null,null,null,null,null,null,null,null,null,null,null,null,203,"Pecans, individual trees","S",60,3,null,4,0.08,null,0,0,null,"l"]
[null,null,null,null,null,null,null,null,null,null,null,null,null,null,null,204,"Pecans, Upland Groves","A",74,148,null,81,1.63,null,100,1,null,"l"]
[null,null,null,null,null,null,null,null,null,null,null,null,null,null,null,205,"Peppers, Bell","A",60,120,null,106,2.13,null,120,0.95,null,"g"]
[null,null,null,null,null,null,null,null,null,null,null,null,null,null,null,206,"Peppers, Chile","A",30,60,null,106,2.13,null,120,0.95,null,"g"]
[null,null,null,null,null,null,null,null,null,null,null,null,null,null,null,207,"Potatoes  (early variety)","A",80,160,null,250,4.17,null,100,0.79,null,"g"]
[null,null,null,null,null,null,null,null,null,null,null,null,null,null,null,208,"Potatoes  (late variety)","A",100,200,null,250,4.17,null,100,0.79,null,"g"]
[null,null,null,null,null,null,null,null,null,null,null,null,null,null,null,209,"Radishes","A",30,60,null,106,2.13,null,120,0.95,null,"g"]
[null,null,null,null,null,null,null,null,null,null,null,null,null,null,null,210,"Range Grass Mix - Est","A",20,40,null,55,1.1000000000000001,null,40,0.32,null,"g"]
[null,null,null,null,null,null,null,null,null,null,null,null,null,null,null,211,"Range Grass Mix, <1000 lb Grazing","A",5,10,null,20,0.4,null,30,0.24,null,"g"]
[null,null,null,null,null,null,null,null,null,null,null,null,null,null,null,212,"Range Grass Mix, >2000 Lb Grazing","A",20,40,null,55,1.1000000000000001,null,120,0.96,null,"g"]
[null,null,null,null,null,null,null,null,null,null,null,null,null,null,null,213,"Range Grass Mix, 1000-2000 lbGrazing","A",10,20,null,40,0.8,null,60,0.48,null,"g"]
[null,null,null,null,null,null,null,null,null,null,null,null,null,null,null,214,"Red Top Cane, Grain","A",30,60,null,80,1.6,null,120,0.96,null,"g"]
[null,null,null,null,null,null,null,null,null,null,null,null,null,null,null,215,"Rhodes Grass","A",20,40,null,65,1.3,null,120,0.96,null,"g"]
[null,null,null,null,null,null,null,null,null,null,null,null,null,null,null,216,"Rhodesgrass - Est.","A",20,40,null,105,2.1,null,120,0.96,null,"g"]
[null,null,null,null,null,null,null,null,null,null,null,null,null,null,null,217,"Rice (Eastern Belt - Clay soils)","A",87.5,175,null,45,1.8,null,40,0.8,null,"g"]
[null,null,null,null,null,null,null,null,null,null,null,null,null,null,null,218,"Rice (Eastern Belt - Sandy soils)","A",75,150,null,45,1.8,null,40,0.8,null,"g"]
[null,null,null,null,null,null,null,null,null,null,null,null,null,null,null,219,"Rice (Western Belt - Clay soils)","A",87.5,175,null,45,1.8,null,40,0.8,null,"g"]
[null,null,null,null,null,null,null,null,null,null,null,null,null,null,null,220,"Rice (Western Belt - Sandy soils)","A",75,150,null,45,1.8,null,40,0.8,null,"g"]
[null,null,null,null,null,null,null,null,null,null,null,null,null,null,null,221,"Rice Fallow (Not Grazed)","A",0,0,0,0,0,0,0,0,0,"g"]
[null,null,null,null,null,null,null,null,null,null,null,null,null,null,null,222,"Rice, Early (Rice Guide)","A",92.5,185,null,45,1.8,null,40,0.8,null,"g"]
[null,null,null,null,null,null,null,null,null,null,null,null,null,null,null,223,"Rice, Early w/Ratoon(Rice Guide)","A",147.5,295,null,60,1.8,null,40,0.8,null,"g"]
[null,null,null,null,null,null,null,null,null,null,null,null,null,null,null,224,"Rice, Late w/Ratoon(Rice Guide)","A",142.5,285,null,60,1.8,null,40,0.8,null,"g"]
[null,null,null,null,null,null,null,null,null,null,null,null,null,null,null,225,"Rice, Late(Rice Guide)","A",85,170,null,45,1.8,null,40,0.8,null,"g"]
[null,null,null,null,null,null,null,null,null,null,null,null,null,null,null,226,"Rice-Flooded (Eastern Belt - Clay soils)","A",90,180,null,45,1.8,null,40,0.8,null,"g"]
[null,null,null,null,null,null,null,null,null,null,null,null,null,null,null,227,"Rice-Flooded (Eastern Belt - Sandy soils)","A",90,180,null,45,1.8,null,40,0.8,null,"g"]
[null,null,null,null,null,null,null,null,null,null,null,null,null,null,null,228,"Rice-Flooded (Western Belt - Clay soils)","A",90,180,null,45,1.8,null,40,0.8,null,"g"]
[null,null,null,null,null,null,null,null,null,null,null,null,null,null,null,229,"Rice-Flooded (Western Belt - Sandy soils)","A",90,180,null,45,1.8,null,40,0.8,null,"g"]
[null,null,null,null,null,null,null,null,null,null,null,null,null,null,null,230,"Roses","S",35,1.75,null,4,0.08,null,0,0,null,"g"]
[null,null,null,null,null,null,null,null,null,null,null,null,null,null,null,231,"Rye, Grain","A",35,70,null,56,1.1299999999999999,null,120,0.95,null,"g"]
[null,null,null,null,null,null,null,null,null,null,null,null,null,null,null,232,"Rye, Heavy Grazing","A",140,280,null,80,null,null,120,0.96,null,"g"]
[null,null,null,null,null,null,null,null,null,null,null,null,null,null,null,233,"Rye, Moderate Grazing","A",70,140,null,55,null,null,120,0.96,null,"g"]
[null,null,null,null,null,null,null,null,null,null,null,null,null,null,null,234,"Ryegrass, Heavy Grazing","A",100,200,null,80,null,null,120,0.96,null,"g"]
[null,null,null,null,null,null,null,null,null,null,null,null,null,null,null,235,"Ryegrass, Moderate Grazing","A",65,130,null,55,null,null,120,0.96,null,"g"]
[null,null,null,null,null,null,null,null,null,null,null,null,null,null,null,236,"Ryegrass, Sod Seeded, Light Grazing","A",40,80,null,105,null,null,120,0.96,null,"g"]
[null,null,null,null,null,null,null,null,null,null,null,null,null,null,null,237,"Sesame","A",25,50,null,81,1.63,null,50,0.4,null,"g"]
[null,null,null,null,null,null,null,null,null,null,null,null,null,null,null,238,"Shade Trees","AS",30,1.39,null,3,0.06,null,0,0,null,"g"]
[null,null,null,null,null,null,null,null,null,null,null,null,null,null,null,239,"Shrubs and Ornamentals","S",30,1.39,null,3,0.06,null,0,0,null,"g"]
[null,null,null,null,null,null,null,null,null,null,null,null,null,null,null,240,"Silage - Corn, 11 - 15 T","A",75,150,null,105,2.1,null,100,0.8,null,"g"]
[null,null,null,null,null,null,null,null,null,null,null,null,null,null,null,241,"Silage - Corn, 16 - 20 T","A",100,200,null,105,2.1,null,120,0.96,null,"g"]
[null,null,null,null,null,null,null,null,null,null,null,null,null,null,null,242,"Silage - Corn, 21 - 25 T","A",125,250,null,105,2.1,null,120,0.96,null,"g"]
[null,null,null,null,null,null,null,null,null,null,null,null,null,null,null,243,"Silage - Corn, 26 - 30 T","A",150,300,null,155,3.1,null,160,1.28,null,"g"]
[null,null,null,null,null,null,null,null,null,null,null,null,null,null,null,244,"Silage - Corn, 7 - 10 T","A",50,100,null,80,1.6,null,55,0.44,null,"g"]
[null,null,null,null,null,null,null,null,null,null,null,null,null,null,null,245,"Silage - Sorghum, 11 - 15 T","A",65,130,null,105,2.1,null,100,0.8,null,"g"]
[null,null,null,null,null,null,null,null,null,null,null,null,null,null,null,246,"Silage - Sorghum, 16 - 20 T","A",90,180,null,105,2.1,null,120,0.96,null,"g"]
[null,null,null,null,null,null,null,null,null,null,null,null,null,null,null,247,"Silage - Sorghum, 21 - 25 T","A",110,220,null,105,2.1,null,120,0.96,null,"g"]
[null,null,null,null,null,null,null,null,null,null,null,null,null,null,null,248,"Silage - Sorghum, 26 - 30 T","A",130,260,null,130,2.6,null,160,1.28,null,"g"]
[null,null,null,null,null,null,null,null,null,null,null,null,null,null,null,249,"Silage - Sorghum, 7-10 T","A",35,70,null,80,1.6,null,55,0.44,null,"g"]
[null,null,null,null,null,null,null,null,null,null,null,null,null,null,null,250,"Sm. Grain or Ryegrass, Intensive Grazing","A",120,240,null,80,1.6,null,120,0.96,null,"g"]
[null,null,null,null,null,null,null,null,null,null,null,null,null,null,null,251,"Sm.Grain or Ryegrass, Sod Seeded, Lt.Grazing","A",30,60,null,105,2.1,null,120,0.96,null,"g"]
[null,null,null,null,null,null,null,null,null,null,null,null,null,null,null,252,"Small Grain or Ryegrass, Moderate Grazing","A",90,180,null,80,1.6,null,120,0.96,null,"g"]
[null,null,null,null,null,null,null,null,null,null,null,null,null,null,null,253,"Sodgrass Production","A",40,80,null,106,2.13,null,160,1.27,null,"g"]
[null,null,null,null,null,null,null,null,null,null,null,null,null,null,null,254,"Sorghum Alum","A",20,40,null,55,1.1000000000000001,null,120,0.96,null,"g"]
[null,null,null,null,null,null,null,null,null,null,null,null,null,null,null,255,"Soybean ","A",5,10,null,81,1.63,null,125,0.71,null,"l"]
[null,null,null,null,null,null,null,null,null,null,null,null,null,null,null,256,"Spinach ","A",20,40,null,106,2.13,null,120,0.95,null,"g"]
[null,null,null,null,null,null,null,null,null,null,null,null,null,null,null,257,"Squash, Summer or Winter","A",20,40,null,106,2.13,null,80,0.64,null,"g"]
[null,null,null,null,null,null,null,null,null,null,null,null,null,null,null,{"$f":"P309+1","v":258},"Strawberries","A",20,40,null,106,2.13,null,120,0.95,null,"g"]
[null,null,null,null,null,null,null,null,null,null,null,null,null,null,null,259,"Sudan - Sorg. Hybrid (1 cut or light graze)","A",40,80,null,55,1.1000000000000001,null,120,0.96,null,"g"]
[null,null,null,null,null,null,null,null,null,null,null,null,null,null,null,260,"Sudan - Sorg. Hybrid (2 cut or moderate graze)","A",70,140,null,55,1.1000000000000001,null,120,0.96,null,"g"]
[null,null,null,null,null,null,null,null,null,null,null,null,null,null,null,261,"Sudan - Sorg. Hybrid (3 cut or heavy graze)","A",100,200,null,105,2.1,null,120,0.96,null,"g"]
[null,null,null,null,null,null,null,null,null,null,null,null,null,null,null,262,"Sudan Grass (1 cutting or light grazing","A",40,80,null,55,1.1000000000000001,null,120,0.96,null,"g"]
[null,null,null,null,null,null,null,null,null,null,null,null,null,null,null,263,"Sudan Grass (2 cuttings or moderate grazing)","A",70,140,null,55,1.1000000000000001,null,120,0.96,null,"g"]
[null,null,null,null,null,null,null,null,null,null,null,null,null,null,null,264,"Sudan Grass (3 cuttings or heavy grazing)","A",100,200,null,105,2.1,null,120,0.96,null,"g"]
[null,null,null,null,null,null,null,null,null,null,null,null,null,null,null,265,"Sugarcane","A",85,170,null,106,2.13,null,150,0.95,null,"g"]
[null,null,null,null,null,null,null,null,null,null,null,null,null,null,null,266,"Sunflowers","A",15,30,null,56,1.1299999999999999,null,30,0.24,null,"g"]
[null,null,null,null,null,null,null,null,null,null,null,null,null,null,null,267,"Sweet Corn ","A",60,120,null,106,2.13,null,80,0.64,null,"g"]
[null,null,null,null,null,null,null,null,null,null,null,null,null,null,null,268,"Sweet Potatoes","A",15,30,null,156,3.13,null,200,1.1399999999999999,null,"g"]
[null,null,null,null,null,null,null,null,null,null,null,null,null,null,null,269,"Swiss Chard","A",60,120,null,81,1.63,null,90,0.71,null,"g"]
[null,null,null,null,null,null,null,null,null,null,null,null,null,null,null,270,"Switchgrass - Est.","A",20,40,null,55,1.1000000000000001,null,120,0.96,null,"g"]
[null,null,null,null,null,null,null,null,null,null,null,null,null,null,null,271,"Switchgrass Grazing","A",20,40,null,55,1.1000000000000001,null,120,0.96,null,"g"]
[null,null,null,null,null,null,null,null,null,null,null,null,null,null,null,272,"Tomatoes ","A",30,60,null,131,2.63,null,160,1.27,null,"g"]
[null,null,null,null,null,null,null,null,null,null,null,null,null,null,null,273,"Triticale, Grain","A",35,70,null,56,1.1299999999999999,null,40,0.32,null,"g"]
[null,null,null,null,null,null,null,null,null,null,null,null,null,null,null,274,"Triticale, Grazing","A",60,120,null,80,1.6,null,120,0.96,null,"g"]
[null,null,null,null,null,null,null,null,null,null,null,null,null,null,null,275,"Turf Fairways - Low, Mod. or High Maint.","A",30,60,null,56,1.1299999999999999,null,150,0.95,null,"g"]
[null,null,null,null,null,null,null,null,null,null,null,null,null,null,null,276,"Turnips - grazing","A",70,140,null,105,2.1,null,120,0.96,null,"g"]
[null,null,null,null,null,null,null,null,null,null,null,null,null,null,null,277,"Turnips - production","A",30,60,null,106,2.13,null,120,0.95,null,"g"]
[null,null,null,null,null,null,null,null,null,null,null,null,null,null,null,278,"Vegetables, Truck Farming","A",90,180,null,131,2.63,null,160,1.27,null,"g"]
[null,null,null,null,null,null,null,null,null,null,null,null,null,null,null,279,"Vetch + Ryegrass or Sm. Grain","A",70,140,null,105,2.1,null,120,0.68600000000000005,null,"l"]
[null,null,null,null,null,null,null,null,null,null,null,null,null,null,null,280,"Watermelons ","A",40,80,null,56,1.1299999999999999,null,60,0.48,null,"g"]
[null,null,null,null,null,null,null,null,null,null,null,null,null,null,null,281,"Wheat (heavy grazing)","A",120,240,null,105,2.1,null,120,0.96,null,"g"]
[null,null,null,null,null,null,null,null,null,null,null,null,null,null,null,282,"Wheat (light grazing)","A",80,160,null,80,1.6,null,120,0.96,null,"g"]
[null,null,null,null,null,null,null,null,null,null,null,null,null,null,null,283,"Wheat (moderate grazing)","A",100,200,null,105,2.1,null,120,0.96,null,"g"]
[null,null,null,null,null,null,null,null,null,null,null,null,null,null,null,284,"Wheat 100 bu grain only","A",75,150,null,94,1.88,null,120,0.95,null,"g"]
[null,null,null,null,null,null,null,null,null,null,null,null,null,null,null,285,"Wheat 20 - 29 bu grain + grazing","A",45,90,null,30,0.6,null,120,0.96,null,"g"]
[null,null,null,null,null,null,null,null,null,null,null,null,null,null,null,286,"Wheat 20 bu grain only","A",22,44,null,31,0.63,null,120,0.95,null,"g"]
[null,null,null,null,null,null,null,null,null,null,null,null,null,null,null,287,"Wheat 30 - 39 bu grain + grazing","A",65,130,null,55,1.1000000000000001,null,120,0.96,null,"g"]
[null,null,null,null,null,null,null,null,null,null,null,null,null,null,null,288,"Wheat 30 bu grain only","A",30,60,null,56,1.1299999999999999,null,120,0.95,null,"g"]
[null,null,null,null,null,null,null,null,null,null,null,null,null,null,null,289,"Wheat 40 - 59 bu grain + grazing","A",90,180,null,75,1.5,null,120,0.96,null,"g"]
[null,null,null,null,null,null,null,null,null,null,null,null,null,null,null,290,"Wheat 40 bu grain only","A",38,76,null,75,1.5,null,120,0.95,null,"g"]
[null,null,null,null,null,null,null,null,null,null,null,null,null,null,null,291,"Wheat 50 bu grain only","A",45,90,null,75,1.5,null,120,0.95,null,"g"]
[null,null,null,null,null,null,null,null,null,null,null,null,null,null,null,292,"Wheat 60 - 79 bu grain + grazing","A",115,230,null,85,1.7,null,120,0.96,null,"g"]
[null,null,null,null,null,null,null,null,null,null,null,null,null,null,null,293,"Wheat 60 bu grain only","A",52,105,null,88,1.75,null,120,0.95,null,"g"]
[null,null,null,null,null,null,null,null,null,null,null,null,null,null,null,294,"Wheat 70 bu grain only","A",60,120,null,88,1.75,null,120,0.95,null,"g"]
[null,null,null,null,null,null,null,null,null,null,null,null,null,null,null,295,"Wheat 80 - 100 bu grain + grazing","A",140,280,null,90,1.8,null,120,0.96,null,"g"]
[null,null,null,null,null,null,null,null,null,null,null,null,null,null,null,296,"Wheat 80 bu grain only","A",68,136,null,94,1.88,null,120,0.95,null,"g"]
[null,null,null,null,null,null,null,null,null,null,null,null,null,null,null,297,"Wheat 90 bu grain only","A",75,150,null,94,1.88,null,120,0.95,null,"g"]
[null,null,null,null,null,null,null,null,null,null,null,null,null,null,null,298,"Wheat Grass-Jose, Heavy Grazing","A",150,300,null,130,2.6,null,120,0.96,null,"g"]
[null,null,null,null,null,null,null,null,null,null,null,null,null,null,null,299,"Wheat Grass-Jose, Light Grazing","A",75,150,null,80,1.6,null,120,0.96,null,"g"]
[null,null,null,null,null,null,null,null,null,null,null,null,null,null,null,300,"Wheat Greenchop 2 Ton @ 75% moisture","A",20,40,null,55,1.1000000000000001,null,120,0.96,null,"g"]
[null,null,null,null,null,null,null,null,null,null,null,null,null,null,null,301,"Wheat Greenchop 3 Ton @ 75% moisture","A",27.5,55,null,55,1.1000000000000001,null,120,0.96,null,"g"]
[null,null,null,null,null,null,null,null,null,null,null,null,null,null,null,302,"Wheat Greenchop 4 Ton @ 75% moisture","A",37.5,75,null,65,1.3,null,150,1,null,"g"]
[null,null,null,null,null,null,null,null,null,null,null,null,null,null,null,303,"Wheat Greenchop 5 Ton @ 75% moisture","A",47.5,95,null,65,1.3,null,150,1,null,"g"]
[null,null,null,null,null,null,null,null,null,null,null,null,null,null,null,304,"Wheat Greenchop 6 Ton @ 75% moisture","A",55,110,null,80,1.6,null,175,1.0940000000000001,null,"g"]
[null,null,null,null,null,null,null,null,null,null,null,null,null,null,null,305,"Wheat Greenchop 7 Ton @ 75% moisture","A",65,130,null,80,1.6,null,175,1.0940000000000001,null,"g"]
[null,null,null,null,null,null,null,null,null,null,null,null,null,null,null,306,"Wheat Greenchop 8 Ton @ 75% moisture","A",75,150,null,80,1.6,null,175,1.0940000000000001,null,"g"]
[null,null,null,null,null,null,null,null,null,null,null,null,null,null,null,307,"Wheat Silage 3 Ton @ 65% moisture","A",35,70,null,55,1.1000000000000001,null,120,0.96,null,"g"]
[null,null,null,null,null,null,null,null,null,null,null,null,null,null,null,308,"Wheat Silage 4.5 Ton @ 65% moisture","A",50,100,null,65,1.3,null,120,0.96,null,"g"]
[null,null,null,null,null,null,null,null,null,null,null,null,null,null,null,309,"Wheat Silage 6 Ton @ 65% moisture","A",70,140,null,65,1.3,null,150,1,null,"g"]
[null,null,null,null,null,null,null,null,null,null,null,null,null,null,null,310,"Wheat Silage 7.5 Ton @ 65% moisture","A",85,170,null,80,1.6,null,150,1,null,"g"]
[null,null,null,null,null,null,null,null,null,null,null,null,null,null,null,311,"Wheat Silage 9 Ton @ 65% moisture","A",105,210,null,80,1.6,null,175,1.0940000000000001,null,"g"]

{"sheet":"break","index":12,"n_rows":5,"n_cols":14,"rows_kept":5,"cut":false,"hidden":true,"merged":[[1,11,1,12],[1,3,1,4],[1,5,1,6],[1,7,1,8],[1,9,1,10]]}
[1,2,3,4,5,6,7,8,9,10,11,12,13,14]
[null,null,null,"P  Very Low",null,"P  Low",null,"P  Medium",null,"P  High",null,"P Very High",null,"Excessive"]
[2,"All Crops",0,0,5,6,4,11,8,20,29,50,39,90]
[null,"Actual P Breakpoints",null,0,5,6,10.4,11,19,20,49,50,89.4,90]
[null,"Actual K Breakpoints",null,null,null,null,null,null,null,null,149,150]

{"sheet":"A&M","index":13,"n_rows":5,"n_cols":14,"rows_kept":5,"cut":false,"hidden":true,"merged":[[1,11,1,12],[1,3,1,4],[1,5,1,6],[1,7,1,8],[1,9,1,10]]}
[1,2,3,4,5,6,7,8,9,10,11,12,13,14]
[null,null,null,"P  Very Low",null,"P  Low",null,"P  Medium",null,"P  High",null,"P Very High",null,"Excessive"]
[2,"All Crops",0,0,5,6,4,11,8,20,29,50,39,90]
[null,"Actual P Breakpoints",null,0,5,6,10.4,11,19,20,49,50,89.4,90]
[null,"Actual K Breakpoints",null,null,null,null,null,null,null,null,149,150]