{"text_format":"1","workbook":"xlsx","n_sheets":14,"sheets":["Instructions","Edits","Fixes","Entry","Specs","Database","Jobsheet1","Jobsheet3","Jobsheet5","O&M","TAMU","EX_Soil_Test","break","A&M"],"not_rendered":{"charts":0,"images":0,"macros":1,"external_links":1,"defined_names":44,"comments":0,"pivot_tables":0},"unopened":[],"bounds":{"document_bytes":16777216,"sheet_cells":100000,"rows_first":2000,"rows_last":500,"rows_between":2000,"halvings":0,"cell_chars":16384,"cell_head_chars":4096},"cells_cut":0,"cells_raw":0,"read":"whole","date_system":"1900"}

{"sheet":"Instructions","index":0,"n_rows":61,"n_cols":6,"rows_kept":61,"cut":false,"hidden":false,"merged":[[52,1,52,6],[57,1,57,6],[59,1,59,6],[60,1,60,6],[53,1,53,6],[54,1,54,6],[56,1,56,6],[55,1,55,6],[58,1,58,6],[16,1,16,6],[15,1,15,6],[12,1,12,6],[23,1,23,6],[22,1,22,6],[19,1,19,6],[1,1,1,6],[2,1,2,6],[3,1,3,6],[10,1,10,6],[4,1,4,6],[5,1,5,6],[6,1,6,6],[7,1,7,6],[8,1,8,6],[9,1,9,6],[50,1,50,6],[43,1,43,6],[48,1,48,6],[49,1,49,6],[47,1,47,6],[45,1,45,6],[46,1,46,6],[44,1,44,6],[24,1,24,6],[17,1,17,6],[18,1,18,6],[31,1,31,3],[25,1,25,6],[27,1,27,2],[28,1,28,3],[29,1,29,3],[33,1,33,3],[42,1,42,6],[41,1,41,6],[38,1,38,3],[37,1,37,3],[34,1,34,3],[35,1,35,3],[36,1,36,3],[11,1,11,6],[13,1,13,6],[14,1,14,6],[51,1,51,6],[20,1,20,6],[21,1,21,6],[39,1,39,3],[40,1,40,6],[30,1,30,3],[32,1,32,3]]}
[]
[null,"INSTRUCTIONS VERSION 5"]
[]
[null,"These instructions are intended to provide guidance to users of this spreadsheet.  USE THIS SPREADSHEET ONLY FOR INORGANIC NUTRIENT PLANS!"]
[null,"This version includes several improvements to the previous version.  There are five primary changes plus numerous small fixes.  The primary changes are: "]
[null,"1.  Adds the Topdressing amount that A&M requires as part of Grass Establishment."]
[null,"2.  Fixes the cross reference error relative to the Purpose identified on the Entry Sheet and the printouts."]
[null,"3.  Cleans up the formulas on the bottom of the Entry Sheet."]
{"$rows_left_out":54}
{"sheet":"Edits","index":1,"n_rows":19,"n_cols":3,"rows_kept":19,"cut":false,"hidden":true,"merged":[]}
["Date","Initials","Summary of Changes"]
["2004-08-20","JRC","Received the new Mehlich III \"P\" formulas from Sam Feagley. "]
["2004-09-09","JRC","Finally figured out the new \"P\" formulas.  Began entering the \"P\" rates and the \"P\" factors into the database sheet.  Updated the soil test conversion formulas on the various sheets to match the Soil Test Conversion \"stand alone\" spreadsheet.  This included changing the TAMU P recommendation breakpoints to the new Mehlich III P breakpoints.  Cleaned up the A&M sheet to only reflect the \"P\" lookup information."]
["2004-09-11","JRC","Finalized the \"P\" formulas in the database to reflect the Mehlich III \"P\" rates, \"P\" factors and the P2O5 calculations.  This included updating and modifying the Entry sheet references for the P2O5 recommendations."]
["2004-09-13","JRC","Sent Tony Provin and Sam Feagley an email relative to the concerns for the cotton nitrogen recommendation which appears to have been changed from 50-75-100 # N to 40-60-80 # N for 1 bale, 1.5 bale and 2 bale cotton respectively and the potassium recommendation for improved bermudagrass establishment."]
["2004-09-23","JRC","Received email from Tony Provin that the cotton should be 50-75-100 # N and that their program was wrong.  Also, the K recommendation that I have is correct."]
["2004-10-21","JRC","Corrected error on Entry Page in recommendation amounts."]
["2005-01-13","JRC","Changed the breakpoints for TAMU P recommendations based on the new lab numbers."]
{"$rows_left_out":12}
{"sheet":"Fixes","index":2,"n_rows":9,"n_cols":2,"rows_kept":9,"cut":false,"hidden":false,"merged":[[2,1,2,8],[3,1,3,8],[4,1,4,8],[5,1,5,8],[6,1,6,8],[7,1,7,8],[8,1,8,8],[9,1,9,8],[10,1,10,8],[11,1,11,8],[12,1,12,8],[13,1,13,8],[14,1,14,8],[15,1,15,8],[16,1,16,8],[17,1,17,8],[18,1,18,8],[19,1,19,8],[20,1,20,8],[21,1,21,8],[26,1,26,8],[27,1,27,8],[22,1,22,8],[23,1,23,8],[24,1,24,8],[25,1,25,8]]}
["Most current fixes:"]
[]
["2006-04-10","fixed the \"Bermudagrass, Common, Hay  (1 cutting + grazing)\" Max N rate. Changed from 11 to 70."]
["2006-05-08","fixed soybeans"]
["2007-03-01","Forage numbers revised based on TAMU, Forage N recs. posted 12/11/06, Forage P recs. posted 11/29/06, and Forage K recs. posted 12/11/06"]
["2007-03-19","Unhid jobsheet sheets. Print macro does not work right with them hidden."]
["2007-03-20","Fixed wheat grain only crops so they work properly."]
["2007-04-17","Added updated P numbers for corn, cotton, and grain sorghum"]
{"$rows_left_out":2}
{"sheet":"Entry","index":3,"n_rows":151,"n_cols":21,"rows_kept":151,"cut":false,"hidden":false,"merged":[[0,2,0,3],[115,0,115,3],[20,18,21,18],[8,3,10,6],[25,1,25,3],[111,0,111,3],[112,0,112,3],[113,0,113,3],[114,0,114,3],[107,0,107,3],[140,5,140,6],[142,5,142,6],[0,6,0,7],[11,0,11,1],[22,1,22,3],[0,0,0,1],[1,0,1,1],[2,0,2,1],[3,0,3,1],[0,4,0,5],[90,0,90,3],[133,2,133,3],[138,5,138,6],[137,2,137,3],[138,2,138,3],[134,5,134,6],[134,2,134,3],[136,5,136,6],[135,2,135,3],[136,2,136,3],[108,0,108,3],[109,0,109,3],[110,0,110,3],[25,13,25,15],[26,13,26,15],[28,13,28,15],[29,13,29,15],[30,13,30,15],[27,13,27,15],[89,0,89,3],[10,0,10,1],[130,0,132,1],[134,0,136,1],[128,2,129,3],[92,0,92,3],[93,0,93,3],[94,0,94,3],[95,0,95,3],[96,0,96,3],[97,0,97,3],[5,4,7,6],[2,2,2,3],[23,13,23,15],[5,0,5,2],[6,0,6,1],[7,0,7,1],[8,0,8,1],[4,0,4,1],[9,0,9,1],[22,13,22,15],[24,13,24,15],[23,1,23,3],[24,1,24,3],[19,4,19,7],[19,8,20,8],[20,0,20,3],[91,0,91,3],[31,13,31,15],[70,0,70,8],[34,0,34,8],[71,0,71,3],[78,0,78,3],[79,0,79,3],[77,0,77,3],[52,0,52,8],[60,0,60,3],[56,0,56,3],[57,0,57,3],[58,0,58,3],[59,0,59,3],[106,0,106,8],[12,0,12,2],[21,1,21,3],[72,0,72,3],[73,0,73,3],[74,0,74,3],[75,0,75,3],[76,0,76,3],[88,0,88,8],[61,0,61,3],[128,4,129,6],[132,5,132,6],[131,2,131,3],[132,2,132,3],[130,2,130,3],[130,5,130,6],[139,2,139,3],[140,2,140,3],[142,0,144,1],[142,2,142,3],[143,2,143,3],[144,2,144,3],[138,0,140,1],[144,5,144,6],[145,2,145,3],[146,0,148,1],[146,2,146,3],[146,5,146,6],[147,2,147,3],[148,2,148,3],[148,5,148,6],[35,0,35,3],[36,0,36,3],[37,0,37,3],[38,0,38,3],[39,0,39,3],[40,0,40,3],[41,0,41,3],[42,0,42,3],[43,0,43,3],[53,0,53,3],[54,0,54,3],[55,0,55,3]]}
["Landuser",null,"example",null,"Purpose",null,"Landuse",null,null,null,null,null,null,null,null,null,null,null,{"$f":"IF(OR($R$27=Database!$B$218,$R$27=Database!$B$219,$R$27=Database!$B$220,$R$27=Database!$B$221,$R$27=Database!$B$222,$R$27=Database!$B$223,$R$27=Database!$B$224,$R$27=Database!$B$225),1,0)","v":0},{"$f":"IF(OR($R$31=Database!$B$218,$R$31=Database!$B$219,$R$31=Database!$B$220,$R$31=Database!$B$221,$R$31=Database!$B$222,$R$31=Database!$B$223,$R$31=Database!$B$224,$R$31=Database!$B$225),1,0)","v":0}]
["Field Number",null,"1",null,"Optimum Yield ..",{"$f":"IF(P2=\"\",\"\",P2)","v":"x"},"               Crops",{"$f":"IF(O2=\"\",\"\",O2)","v":"x"},null,null,null,null,null,null,"x","x",null,null,{"$f":"IF(OR($R$27=Database!$B$5,$R$27=Database!#REF!,$R$27=Database!$B$6,$R$27=Database!$B$7),1,0)","v":{"$error":"#REF!"}},{"$f":"IF(OR($R$31=Database!$B$5,$R$31=Database!#REF!,$R$31=Database!$B$6,$R$31=Database!$B$7),1,0)","v":{"$error":"#REF!"}}]
["Assisted By",null,null,null,"Quick Cover …..",{"$f":"IF(P3=\"\",\"\",P3)","v":""},"Grass Est.",{"$f":"IF(O3=\"\",\"\",O3)","v":""},null,null,null,null,null,null,null,null,null,null,{"$f":"IF(OR($R$27=Database!$B$230,$R$27=Database!$B$231),1,0)","v":0},{"$f":"IF(OR($R$31=Database!$B$230,$R$31=Database!$B$231),1,0)","v":0}]
["Year 1 of plan",null,2007,null,"Water Quality….",{"$f":"IF(P4=\"\",\"\",P4)","v":""},"Forage",{"$f":"IF(O4=\"\",\"\",O4)","v":""},null,null,null,null,null,null,null,null,null,null,{"$f":"IF($R$27=Database!$B$73,1,0)","v":0},{"$f":"IF($R$31=Database!$B$73,1,0)","v":0}]
["Rainfall Inches",null,45,null,"Soil Condition….",{"$f":"IF(P5=\"\",\"\",P5)","v":""},null,null,null,null,null,null,null,null,{"$f":"COUNTA(O2:O4,P2:P4,P7:P11)","v":3}]
["Soil Test",null,null,null,"Inorganic Fertilizers Only      (Version 6)",null,null,null,null,null,null,null,null,null,{"$f":"COUNT(TAMU!A3:D3)","v":4},null,null,null,{"$f":"SUM(S1:S4)","v":{"$error":"#REF!"}},{"$f":"SUM(T1:T4)","v":{"$error":"#REF!"}},"(These formulas goto S5 and T5 if necessary)"]
["Mehlich III",null,{"$f":"IF(P7=\"\",\"\",P7)","v":"x"},null,null,null,null,null,null,null,null,null,null,null,{"$f":"(TAMU!A3)","v":5.6},"x"]
[null,null,{"$f":"IF(P8=\"\",\"\",P8)","v":""}]
{"$rows_left_out":144}
{"sheet":"Specs","index":4,"n_rows":154,"n_cols":6,"rows_kept":154,"cut":false,"hidden":false,"merged":[]}
[]
[{"$f":"+\"YEAR   1                 ( \"&Entry!$C$4&\" )\"","v":"YEAR   1                 ( 2007 )"},null,null,{"$f":"IF(A6=\"auto recommendation used\",\"\",\"Over-ride Values\")","v":""}]
[{"$f":"+\"Crop / Grass Species and Yield:           \"&IF(Entry!$B$22=\"\",\"None Selected\",Entry!$B$22)","v":"Crop / Grass Species and Yield:           Corn 200 bu"},{"$f":"IF(A6=\"auto recommendation used\",\"\",\"N\")","v":""},{"$f":"IF(A6=\"auto recommendation used\",\"\",\"P2O5\")","v":""},{"$f":"IF(A6=\"auto recommendation used\",\"\",\"K2O\")","v":""}]
[null,null,null,null,null,"Over-ride auto recommendation. Enter adjusted recommendation to the right; explain in specifications."]
[{"$f":"+\"pH level as identified by soil test:                     \"&IF(AND(Entry!$H$2=\"\",Entry!$H$3=\"\",Entry!$H$4=\"\"),\"\",IF(TAMU!$A$3<>\"\",TAMU!$A$3,IF(#REF!<>\"\",#REF!,IF(#REF!<>\"\",#REF!,IF(#REF!<>\"\",#REF!,IF(#REF!<>\"\",#REF!,\"error\"))))))&\"                           Lime:         \"&IF(Entry!$H$22=\"\",\"\",Entry!$H$22)&\"       \"&IF(Entry!$H$22=\"\",\"\",IF(Entry!$H$22>1,\"Tons\",\"Ton\"))","v":"pH level as identified by soil test:                     5.6                           Lime:         1       Ton"}]
[{"$f":"IF(A4=\"\",\"Auto Recommendation Used\",\"Manual Over-ride Used for Year 1\")","v":"Auto Recommendation Used"},null,null,null,null,{"$f":"Entry!$H$3","v":""}]
[{"$f":"+\"Recommended nutrient application to meet yield goal:             \"&IF(OR(Entry!$B$22=\"\",A4=\"Over-ride auto recommendation. Enter adjusted recommendation to the right; explain in specifications.\"),(B4&\" - \"&C4&\" - \"&D4)&\"         =      \"&IF(Entry!$H$3=\"x\",\"( Establishment Rate )\",IF(Entry!$H$2=\"x\",\"( Soil Test Rate )\",IF(Entry!$H$4=\"x\",\"( Grass Production Rate )\",\"\"))),(Entry!E22&\" - \"&Entry!F22&\" - \"&Entry!G22)&\"         =      \"&IF(Entry!$H$3=\"x\",\"( Establishment Rate )\",IF(Entry!$H$2=\"x\",\"( Soil Test Rate )\",IF(Entry!$H$4=\"x\",\"( Grass Production Rate )\"))))","v":"Recommended nutrient application to meet yield goal:             245 - 115 - 120         =      ( Soil Test Rate )"},null,null,null,null,{"$f":"Entry!I22","v":""}]
[{"$f":"IF(Entry!$H$3=\"\",\"\",+\"After emergence/rooting, topdress with extra NITROGEN:      \"&IF(Entry!$L$14>0,VLOOKUP(Entry!$L$14,establish,16)&\"  \"&\"Units of Actual N\"))","v":""}]
{"$rows_left_out":147}
{"sheet":"Database","index":5,"n_rows":699,"n_cols":26,"rows_kept":699,"cut":false,"hidden":false,"merged":[[338,3,340,3],[338,9,340,9],[338,4,340,4],[338,8,340,8],[338,5,340,5],[0,8,2,8],[1,13,1,15],[0,9,2,9],[0,10,2,10],[338,10,340,10],[338,11,340,11],[0,7,2,7],[338,6,340,6],[338,7,340,7],[0,0,2,0],[0,11,2,11],[0,1,2,1],[0,3,2,3],[0,4,2,4],[0,6,2,6],[0,5,2,5]]}
[null,"A & M Web Page Data 1/","Units","NO3-N ppm","Max        N         lbs","Recom lbs / unit","P rate","P Factor","Recom lbs / unit","K rate","K Factor","Recom lbs / unit",null,23,24,25]
[null,null,"A = Ac",null,null,null,null,null,null,null,null,null,null,"2nd Application of N"]
[null,null,"S = SF",null,null,null,null,null,null,null,null,null,"nutrient","Constant","Adjust.","Calculated"]
[1," AFRICAN MILLET  ","A",30,60,null,55,1.1000000000000001,null,40,0.32]
[{"$f":"A4+1","v":2}," ALFALFA (NON-IRRIGATED) 4 Ton","A",10,20,null,80,1.333,null,120,0.96,null,null,null,null,null,null,null,null,null,null,null,null,null,null,"E"]
[{"$f":"A5+1","v":3}," ALFALFA (IRRIGATED) 6 TON","A",10,20,null,130,2.1669999999999998,null,160,1.28]
[4," ALFALFA (IRRIGATED) 8-12 TON","A",10,20,null,180,3,null,200,1.6]
[5,"Aloe Vera","A",25,50,null,3,0.06,null,40,0.32]
{"$rows_left_out":692}
{"sheet":"Jobsheet1","index":6,"n_rows":18,"n_cols":12,"rows_kept":18,"cut":false,"hidden":false,"merged":[[1,0,1,11],[12,3,12,6],[0,2,0,5],[12,7,12,8],[8,7,8,8],[9,2,9,3],[6,7,7,8],[0,7,0,11],[6,9,7,9],[6,10,7,10],[9,7,9,8],[10,7,10,8],[11,7,11,8],[10,0,11,2],[6,0,9,0],[6,2,6,3],[7,2,7,3],[13,0,16,0],[14,1,14,4],[17,0,17,11],[15,1,15,4],[16,1,16,11],[15,6,15,8],[13,9,13,11],[13,1,13,8],[14,5,14,8],[4,9,4,11],[5,9,5,11],[2,1,2,9],[4,1,4,4],[5,1,5,4],[8,2,8,3],[6,11,7,11]]}
[null,null,null,null,null,null,null,"No Direct Entry On This Page"]
["Plan for Establishment Year Only"]
[null,"NUTRIENT MANAGEMENT JOBSHEET AND SPECIFICATIONS"]
[]
["Landuser :",{"$f":"IF(Entry!$H$3=\"\",\"\",IF(Entry!$C$1=\"\",\"\",Entry!$C$1))","v":""},null,null,null,null,null,null,"Date :",{"$f":"IF(Entry!$H$3=\"\",\"\",IF($B$5=\"\",\"\",TODAY()))","v":""}]
["Assisted By :",{"$f":"IF(Entry!$H$3=\"\",\"\",IF(Entry!$C$3=\"\",\"\",Entry!$C$3))","v":""},null,null,null,null,null,null,"Field No :",{"$f":"IF(Entry!$H$3=\"\",\"\",IF(Entry!$C$2=\"\",\"\",Entry!$C$2))","v":""}]
["PURPOSE    (Mark All     That Apply)",null,"Optimum Yield",null,null,{"$f":"IF(Entry!$H$3=\"\",\"\",IF(Entry!$F$2=\"\",\"\",Entry!$F$2))","v":""},null,"Credits From Various Sources",null,"N","P2O5","K2O"]
[null,null,"Quick Cover",null,null,{"$f":"IF(Entry!$H$3=\"\",\"\",IF(Entry!$F$3=\"\",\"\",Entry!$F$3))","v":""}]
{"$rows_left_out":11}
{"sheet":"Jobsheet3","index":7,"n_rows":31,"n_cols":12,"rows_kept":31,"cut":false,"hidden":false,"merged":[[22,1,22,8],[22,0,25,0],[17,0,20,0],[17,9,17,11],[22,9,22,11],[21,0,21,11],[17,1,17,8],[20,1,20,11],[19,1,19,4],[19,6,19,8],[30,0,30,11],[29,0,29,11],[28,0,28,11],[26,0,26,11],[3,9,3,11],[4,9,4,11],[14,6,14,8],[12,9,12,11],[12,1,12,8],[13,5,13,8],[18,1,18,4],[12,0,15,0],[18,5,18,8],[13,1,13,4],[16,0,16,11],[14,1,14,4],[15,1,15,11],[5,0,8,0],[5,2,5,3],[6,2,6,3],[7,2,7,3],[1,1,1,9],[3,1,3,4],[4,1,4,4],[0,2,0,5],[11,7,11,8],[7,7,7,8],[8,2,8,3],[5,7,6,8],[8,7,8,8],[9,7,9,8],[10,7,10,8],[11,3,11,6],[0,7,0,11],[5,9,6,9],[5,10,6,10],[5,11,6,11],[9,0,10,2],[25,1,25,11],[23,1,23,4],[24,1,24,4],[23,5,23,8],[24,6,24,8]]}
[null,null,null,null,null,null,null,"No Direct Entry On This Page"]
[null,"NUTRIENT MANAGEMENT JOBSHEET AND SPECIFICATIONS"]
[]
["Landuser :",{"$f":"IF(Entry!$C$5<25,\"\",IF(Entry!$C$1=\"\",\"\",Entry!$C$1))","v":"example"},null,null,null,null,null,null,"Date :",{"$f":"IF(Entry!$C$5<25,\"\",IF($B$4=\"\",\"\",TODAY()))","v":"2011-02-23"}]
["Assisted By :",{"$f":"IF(Entry!$C$5<25,\"\",IF(Entry!$C$3=\"\",\"\",Entry!$C$3))","v":""},null,null,null,null,null,null,"Field No :",{"$f":"IF(Entry!$C$5<25,\"\",IF(Entry!$C$2=\"\",\"\",Entry!$C$2))","v":"1"}]
["PURPOSE    (Mark All     That Apply)",null,"Optimum Yield",null,null,{"$f":"IF(Entry!$C$5<25,\"\",IF(Entry!$F$2=\"\",\"\",Entry!$F$2))","v":"x"},null,"Credits From Various Sources",null,"N","P2O5","K2O"]
[null,null,"Quick Cover",null,null,{"$f":"IF(Entry!$C$5<25,\"\",IF(Entry!$F$3=\"\",\"\",Entry!$F$3))","v":""}]
[null,null,"Water Quality",null,null,{"$f":"IF(Entry!$C$5<25,\"\",IF(Entry!$F$4=\"\",\"\",Entry!$F$4))","v":""},null,{"$f":"IF(Entry!$C$5<25,\"\",IF(Entry!$C$4=\"\",\"\",+\"YEAR 1        (\"&Entry!$C$4&\")\"))","v":"YEAR 1        (2007)"},null,{"$f":"IF(Entry!$C$5<25,\"\",IF(Entry!$E$44=\"\",\"\",Entry!$E$44))","v":0},{"$f":"IF(Entry!$C$5<25,\"\",IF(Entry!$G$44=\"\",\"\",Entry!$G$44))","v":0},{"$f":"IF(Entry!$C$5<25,\"\",IF(Entry!$I$44=\"\",\"\",Entry!$I$44))","v":0}]
{"$rows_left_out":24}
{"sheet":"Jobsheet5","index":8,"n_rows":41,"n_cols":12,"rows_kept":41,"cut":false,"hidden":false,"merged":[[0,2,0,5],[11,7,11,8],[7,7,7,8],[25,1,25,11],[23,1,23,4],[24,1,24,4],[23,5,23,8],[24,6,24,8],[12,1,12,8],[13,5,13,8],[8,7,8,8],[9,7,9,8],[10,7,10,8],[9,0,10,2],[5,0,8,0],[5,2,5,3],[6,2,6,3],[7,2,7,3],[8,2,8,3],[5,7,6,8],[18,5,18,8],[13,1,13,4],[16,0,16,11],[19,1,19,4],[19,6,19,8],[14,1,14,4],[1,1,1,9],[3,1,3,4],[4,1,4,4],[5,9,6,9],[5,10,6,10],[5,11,6,11],[40,0,40,11],[33,5,33,8],[38,0,38,11],[39,0,39,11],[35,1,35,11],[3,9,3,11],[4,9,4,11],[22,9,22,11],[21,0,21,11],[20,1,20,11],[36,0,36,11],[37,0,37,11],[0,7,0,11],[26,0,26,11],[34,6,34,8],[22,1,22,8],[22,0,25,0],[17,0,20,0],[12,9,12,11],[15,1,15,11],[17,9,17,11],[28,1,28,4],[29,1,29,4],[28,5,28,8],[11,3,11,6],[27,0,30,0],[18,1,18,4],[14,6,14,8],[17,1,17,8],[12,0,15,0],[31,0,31,11],[32,0,35,0],[32,1,32,8],[32,9,32,11],[27,9,27,11],[27,1,27,8],[30,1,30,11],[29,6,29,8],[33,1,33,4],[34,1,34,4]]}
[null,null,null,null,null,null,null,"No Direct Entry On This Page"]
[null,"NUTRIENT MANAGEMENT JOBSHEET AND SPECIFICATIONS"]
[]
["Landuser :",{"$f":"IF(Entry!$C$5>=25,\"\",IF(Entry!$C$1=\"\",\"\",Entry!$C$1))","v":""},null,null,null,null,null,null,"Date :",{"$f":"IF(Entry!$C$5>=25,\"\",IF($B$4=\"\",\"\",TODAY()))","v":""}]
["Assisted By :",{"$f":"IF(Entry!$C$5>=25,\"\",IF(Entry!$C$3=\"\",\"\",Entry!$C$3))","v":""},null,null,null,null,null,null,"Field No :",{"$f":"IF(Entry!$C$5>=25,\"\",IF(Entry!$C$2=\"\",\"\",Entry!$C$2))","v":""}]
["PURPOSE    (Mark All     That Apply)",null,"Optimum Yield",null,null,{"$f":"IF(Entry!$C$5>=25,\"\",IF(Entry!$F$2=\"\",\"\",Entry!$F$2))","v":""},null,"Credits From Various Sources",null,"N","P2O5","K2O"]
[null,null,"Quick Cover",null,null,{"$f":"IF(Entry!$C$5>=25,\"\",IF(Entry!$F$3=\"\",\"\",Entry!$F$3))","v":""}]
[null,null,"Water Quality",null,null,{"$f":"IF(Entry!$C$5>=25,\"\",IF(Entry!$F$4=\"\",\"\",Entry!$F$4))","v":""},null,{"$f":"IF(Entry!$C$5>=25,\"\",IF(Entry!$C$4=\"\",\"\",+\"YEAR 1        (\"&Entry!$C$4&\")\"))","v":""},null,{"$f":"IF(Entry!$C$5>=25,\"\",IF(Entry!$E$44=\"\",\"\",Entry!$E$44))","v":""},{"$f":"IF(Entry!$C$5>=25,\"\",IF(Entry!$G$44=\"\",\"\",Entry!$G$44))","v":""},{"$f":"IF(Entry!$C$5>=25,\"\",IF(Entry!$I$44=\"\",\"\",Entry!$I$44))","v":""}]
{"$rows_left_out":34}
{"sheet":"O&M","index":9,"n_rows":61,"n_cols":7,"rows_kept":61,"cut":false,"hidden":false,"merged":[[9,1,9,6],[0,4,0,6],[4,1,4,4],[14,1,14,6],[16,1,16,6],[12,1,12,6],[10,1,10,6],[11,1,11,6],[2,1,2,6],[3,1,3,6],[5,1,5,6],[20,1,20,6],[17,1,17,6],[18,1,18,6],[19,1,19,6],[13,1,13,6],[1,2,1,3],[1,5,1,6],[7,1,7,6],[8,1,8,6],[6,1,6,4]]}
[null,null,null,null,"No Direct Entry On This Page"]
[null,"Landuser:",{"$f":"IF(Entry!$C$1=\"\",\"\",Entry!$C$1)","v":"example"},null,"Field:  ",{"$f":"IF(Entry!$C$2=\"\",\"\",Entry!$C$2)","v":"1"}]
[null,"Operations and Maintenance"]
[null,"The producer should review this plan annually.  In addition, this plan should be reviewed with and revised by a Certified Nutrient Management Specialist immediately after new soil tests and recommendations have been obtained.  "]
[null,"At a minimum, all fields with inorganic nutrients applied will have a soil test every",null,null,null,{"$f":"IF(Entry!$C$5>=25,\"3 years.\",\"5 years.\")","v":"3 years."},"In areas where animal"]
[null,"wastes are applied, a soil test is required every other year.  STATE REGULATIONS TAKES PRECEDENCE OVER THESE GUIDELINES WHERE APPLICABLE.  Additional soil tests should be considered after years of extremely high or low"]
[null,"production (+/- 30% of the realistic yield goal).  Normal rainfall for this county is: ",null,null,null,{"$f":"Entry!$C$5&\" inches\"","v":"45 inches"}]
[null,"Sampling depths will be 0-6 inches unless nutrients are injected, knifed in, or otherwise placed below the surface in which case the sampling depth will be between 3-9 inches.  Soil sampling and collection should be in accordance to guidance provided by the Texas Cooperative Extension (TCE)."]
{"$rows_left_out":54}
{"sheet":"TAMU","index":10,"n_rows":5,"n_cols":4,"rows_kept":5,"cut":false,"hidden":false,"merged":[[0,0,0,6],[3,0,3,6]]}
["A & M Test Results (ppm)"]
["pH","Nitrogen","Phosphorus","Potassium"]
[5.6,2,5,80]
[]
[null,null,{"$f":"IF(C3=\"\",\"\",IF(C3<='A&M'!E4,\"Very Low\",IF(AND(C3>='A&M'!F4,C3<='A&M'!G4),\"Low\",IF(AND(C3>='A&M'!H4,C3<='A&M'!I4),\"Medium\",IF(AND(C3>='A&M'!J4,C3<='A&M'!K4),\"High\",IF(AND(C3>='A&M'!L4,C3<='A&M'!M4),\"Very High\",\"Excessive\"))))))","v":"Very Low"}]

{"sheet":"EX_Soil_Test","index":11,"n_rows":363,"n_cols":38,"rows_kept":363,"cut":false,"hidden":false,"merged":[[0,0,0,2],[2,0,2,2],[0,4,2,11],[11,2,11,11],[10,2,10,11],[4,5,4,9],[4,0,4,2],[5,0,5,2],[6,0,6,2],[7,0,7,2],[14,5,14,10],[49,24,51,24],[49,25,51,25],[8,2,8,5],[9,2,9,11],[30,0,49,12],[49,26,51,26],[49,16,51,16],[49,17,51,17],[49,15,51,15],[49,18,51,18],[49,19,51,19],[49,20,51,20],[49,21,51,21],[49,22,51,22],[49,23,51,23]]}
["Example soil lab",null,null,null,"This sheet is for demonstration purposes only and is not intended to provide the same results as Texas A&M University Soil Lab"]
["Anywhere, USA"]
[]
["Report generated for:"]
[{"$f":"Entry!C1","v":"example"},null,null,null,null,"Soil Test Results"]
[{"$f":"Entry!C2","v":"1"},null,null,null,null,"Mehlich III by ICP used for this analysis.",null,null,null,null,null,null,null,null,"Coarse"]
["Coarse",null,null,"Soil Textural Group",null,null,null,null,null,null,null,null,null,null,"Medium"]
[null,null,null,"County",null,null,null,null,null,null,null,null,null,null,"Fine"]
{"$rows_left_out":356}
{"sheet":"break","index":12,"n_rows":5,"n_cols":14,"rows_kept":5,"cut":false,"hidden":true,"merged":[[1,11,1,12],[1,3,1,4],[1,5,1,6],[1,7,1,8],[1,9,1,10]]}
[1,2,3,4,5,6,7,8,9,10,11,12,13,14]
[null,null,null,"P  Very Low",null,"P  Low",null,"P  Medium",null,"P  High",null,"P Very High",null,"Excessive"]
[2,"All Crops",0,0,5,6,4,11,8,20,29,50,39,90]
[null,"Actual P Breakpoints",null,0,5,6,10.4,11,19,20,49,50,89.4,90]
[null,"Actual K Breakpoints",null,null,null,null,null,null,null,null,149,150]

{"sheet":"A&M","index":13,"n_rows":5,"n_cols":14,"rows_kept":5,"cut":false,"hidden":true,"merged":[[1,11,1,12],[1,3,1,4],[1,5,1,6],[1,7,1,8],[1,9,1,10]]}
[1,2,3,4,5,6,7,8,9,10,11,12,13,14]
[null,null,null,"P  Very Low",null,"P  Low",null,"P  Medium",null,"P  High",null,"P Very High",null,"Excessive"]
[2,"All Crops",0,0,5,6,4,11,8,20,29,50,39,90]
[null,"Actual P Breakpoints",null,0,5,6,10.4,11,19,20,49,50,89.4,90]
[null,"Actual K Breakpoints",null,null,null,null,null,null,null,null,149,150]